{
  "version": "1.0",
  "description": "Poky reference distribution for kirkstone",
  "sources": {
    "oe-layersetup": {
      "git-remote": {
        "remotes": {
          "origin": {
            "uri": "https://git.ti.com/git/arago-project/oe-layersetup.git"
          }
        },
        "rev": "master"
      },
      "path": "oe-layersetup"
    },
    "bitbake": {
      "git-remote": {
        "remotes": {
          "origin": {
            "uri": "https://git.openembedded.org/bitbake"
          }
        },
        "rev": "2.0"
      },
      "path": "bitbake"
    },
    "meta-yocto": {
      "git-remote": {
        "remotes": {
          "origin": {
            "uri": "https://git.yoctoproject.org/meta-yocto"
          }
        },
        "rev": "kirkstone"
      },
      "path": "meta-yocto"
    },
    "meta-ti": {
      "git-remote": {
        "remotes": {
          "origin": {
            "uri": "https://git.yoctoproject.org/meta-ti"
          }
        },
        "rev": "kirkstone"
      },
      "path": "meta-ti"
    },
    "meta-arm": {
      "git-remote": {
        "remotes": {
          "origin": {
            "uri": "https://git.yoctoproject.org/meta-arm"
          }
        },
        "rev": "kirkstone"
      },
      "path": "meta-arm"
    },
    "oe-core": {
      "git-remote": {
        "remotes": {
          "origin": {
            "uri": "https://git.openembedded.org/openembedded-core"
          }
        },
        "rev": "kirkstone"
      },
      "path": "oe-core"
    },
    "meta-arago": {
      "git-remote": {
        "remotes": {
          "origin": {
            "uri": "https://git.yoctoproject.org/meta-arago"
          }
        },
        "rev": "kirkstone"
      },
      "path": "meta-arago"
    }
  },
  "configuration": {
    "bitbake-setup": {
      "default": {
        "description": "Default build configuration",
         "template": "oe-layersetup-poky-kirkstone-config",
         "targets": [ "bitbake -k core_image_minimal" ]
      }
    }
  }
}
