{
  "version": "1.0",
  "description": "Arago reference distribution for scarthgap",
  "sources": {
    "oe-layersetup": {
      "git-remote": {
        "remotes": {
          "origin": {
            "uri": "https://git.ti.com/git/arago-project/oe-layersetup.git"
          }
        },
        "rev": "master"
      },
      "path": "oe-layersetup"
    },
    "bitbake": {
      "git-remote": {
        "remotes": {
          "origin": {
            "uri": "https://git.openembedded.org/bitbake"
          }
        },
        "rev": "2.8"
      },
      "path": "bitbake"
    },
    "meta-arago": {
      "git-remote": {
        "remotes": {
          "origin": {
            "uri": "https://git.yoctoproject.org/meta-arago"
          }
        },
        "rev": "scarthgap"
      },
      "path": "meta-arago"
    },
    "meta-selinux": {
      "git-remote": {
        "remotes": {
          "origin": {
            "uri": "https://git.yoctoproject.org/meta-selinux"
          }
        },
        "rev": "scarthgap"
      },
      "path": "meta-selinux"
    },
    "meta-qt6": {
      "git-remote": {
        "remotes": {
          "origin": {
            "uri": "https://code.qt.io/yocto/meta-qt6.git"
          }
        },
        "rev": "6.9"
      },
      "path": "meta-qt6"
    },
    "meta-virtualization": {
      "git-remote": {
        "remotes": {
          "origin": {
            "uri": "https://git.yoctoproject.org/meta-virtualization"
          }
        },
        "rev": "scarthgap"
      },
      "path": "meta-virtualization"
    },
    "meta-openembedded": {
      "git-remote": {
        "remotes": {
          "origin": {
            "uri": "https://git.openembedded.org/meta-openembedded"
          }
        },
        "rev": "scarthgap"
      },
      "path": "meta-openembedded"
    },
    "meta-ti": {
      "git-remote": {
        "remotes": {
          "origin": {
            "uri": "https://git.yoctoproject.org/meta-ti"
          }
        },
        "rev": "scarthgap"
      },
      "path": "meta-ti"
    },
    "meta-arm": {
      "git-remote": {
        "remotes": {
          "origin": {
            "uri": "https://git.yoctoproject.org/meta-arm"
          }
        },
        "rev": "scarthgap"
      },
      "path": "meta-arm"
    },
    "meta-clang": {
      "git-remote": {
        "remotes": {
          "origin": {
            "uri": "https://github.com/kraj/meta-clang"
          }
        },
        "rev": "scarthgap"
      },
      "path": "meta-clang"
    },
    "oe-core": {
      "git-remote": {
        "remotes": {
          "origin": {
            "uri": "https://git.openembedded.org/openembedded-core"
          }
        },
        "rev": "scarthgap"
      },
      "path": "oe-core"
    }
  },
  "configuration": {
    "bitbake-setup": {
      "default": {
        "description": "Default build configuration",
         "template": "oe-layersetup-arago-scarthgap-selinux-config",
         "targets": [ "bitbake -k tisdk-default-image" ]
      }
    }
  }
}
