{
  "version": "1.0",
  "description": "TI Processor SDK v09.01.00-am65xx",
  "sources": {
    "oe-layersetup": {
      "git-remote": {
        "remotes": {
          "origin": {
            "uri": "https://git.ti.com/git/arago-project/oe-layersetup.git"
          }
        },
        "rev": "master"
      },
      "path": "oe-layersetup"
    },
    "bitbake": {
      "git-remote": {
        "remotes": {
          "origin": {
            "uri": "https://git.openembedded.org/bitbake"
          }
        },
        "rev": "2.0"
      },
      "path": "bitbake"
    },
    "meta-processor-sdk": {
      "git-remote": {
        "remotes": {
          "origin": {
            "uri": "https://git.ti.com/git/processor-sdk/meta-processor-sdk.git"
          }
        },
        "rev": "kirkstone"
      },
      "path": "meta-processor-sdk"
    },
    "meta-arago": {
      "git-remote": {
        "remotes": {
          "origin": {
            "uri": "https://git.yoctoproject.org/meta-arago"
          }
        },
        "rev": "kirkstone"
      },
      "path": "meta-arago"
    },
    "meta-qt5": {
      "git-remote": {
        "remotes": {
          "origin": {
            "uri": "https://github.com/meta-qt5/meta-qt5.git"
          }
        },
        "rev": "kirkstone"
      },
      "path": "meta-qt5"
    },
    "meta-virtualization": {
      "git-remote": {
        "remotes": {
          "origin": {
            "uri": "https://git.yoctoproject.org/meta-virtualization"
          }
        },
        "rev": "kirkstone"
      },
      "path": "meta-virtualization"
    },
    "meta-openembedded": {
      "git-remote": {
        "remotes": {
          "origin": {
            "uri": "https://git.openembedded.org/meta-openembedded"
          }
        },
        "rev": "kirkstone"
      },
      "path": "meta-openembedded"
    },
    "meta-ti": {
      "git-remote": {
        "remotes": {
          "origin": {
            "uri": "https://git.yoctoproject.org/meta-ti"
          }
        },
        "rev": "kirkstone"
      },
      "path": "meta-ti"
    },
    "meta-arm": {
      "git-remote": {
        "remotes": {
          "origin": {
            "uri": "https://git.yoctoproject.org/meta-arm"
          }
        },
        "rev": "kirkstone"
      },
      "path": "meta-arm"
    },
    "oe-core": {
      "git-remote": {
        "remotes": {
          "origin": {
            "uri": "https://git.openembedded.org/openembedded-core"
          }
        },
        "rev": "kirkstone"
      },
      "path": "oe-core"
    }
  },
  "configuration": {
    "bitbake-setup": {
      "default": {
        "description": "Default build configuration",
         "template": "oe-layersetup-processor-sdk_processor-sdk-09.01.00-am65xx-config",
         "targets": [ "bitbake -k tisdk-default-image" ]
      }
    }
  }
}
