{
    "widgetBindings": [
        {
            "widgetId": "demo_element",
            "serverBindName": "widget.labels.value",
            "propertyName": "labels"
        },
        {
            "widgetId": "demo_element",
            "serverBindName": "widget.values.value",
            "propertyName": "values"
        },
        {
            "widgetId": "demo_element",
            "serverBindName": "widget.initial_index.value",
            "propertyName": "initialIndex"
        },
        {
            "widgetId": "demo_element",
            "serverBindName": "widget.sorted.checked",
            "propertyName": "sorted"
        },
        {
            "widgetId": "demo_element",
            "serverBindName": "widget.has_delete_icon.checked",
            "propertyName": "hasDeleteIcon"
        },
        {
            "widgetId": "demo_element",
            "serverBindName": "widget.selected_index.value",
            "propertyName": "selectedIndex"
        },
        {
            "widgetId": "demo_element",
            "serverBindName": "widget.selected_label.value",
            "propertyName": "selectedLabel"
        },
        {
            "widgetId": "demo_element",
            "serverBindName": "widget.selected_value.value",
            "propertyName": "selectedValue"
        },
        {
            "widgetId": "demo_element",
            "serverBindName": "widget.readonly.checked",
            "propertyName": "readonly"
        },
        {
            "widgetId": "demo_element",
            "serverBindName": "widget.disabled.checked",
            "propertyName": "disabled"
        }
    ]
}