{
    "widgetBindings": [
        {
            "widgetId": "demo_element",
            "serverBindName": "widget.anchor_id.selectedLabel",
            "propertyName": "anchorId"
        },
        {
            "widgetId": "demo_element",
            "serverBindName": "widget.position.selectedLabel",
            "propertyName": "position"
        },
        {
            "widgetId": "demo_element",
            "serverBindName": "widget.text.value",
            "propertyName": "text"
        }
    ]
}