{
	widgetBindings : [
 
		{
		widgetId : "main_graph", 
		propertyName : "series3", 
		serverBindName : "value:pm.active.gDLog4CHBuff2",
		options : 
		{  
			dataType		: "Array",
			inPreProcessingFunction: $ConversionHelpers.Display_DLOG_4CH_buff1_One_Big_Graph,
dropUpdate : 1000, 
forceUpdate : 3000,

		},
	}, 
	{
		widgetId : "main_graph", 
		propertyName : "series1", 
		serverBindName : "value:pm.active.gDLog4CHBuff3",
		options : 
		{  
			dataType		: "Array",
			inPreProcessingFunction: $ConversionHelpers.Display_DLOG_4CH_buff2_One_Big_Graph,
dropUpdate : 1000, 
forceUpdate : 3000,

		},
	},
	{
		widgetId : "main_graph", 
		propertyName : "series2", 
		serverBindName : "value:pm.active.gDLog4CHBuff4",
		options : 
		{  
			dataType		: "Array",
			inPreProcessingFunction: $ConversionHelpers.Display_DLOG_4CH_buff3_One_Big_Graph,
dropUpdate : 1000, 
forceUpdate : 3000,

		},
	},





	{
		widgetId : "Graph_Time_Scaler", 
		propertyName : "value", 
		serverBindName : "value:pm.active.gGUIObj.LogScalar ",
		options : 
		{  
			dataType		: "Double",			
		},
	},



	]
}


