digraph dependencies {
    label="\nPackage demos.image_processing.openmp.evmc6670l.platform Dependency Graph";
    size="7.5,10";
    rankdir=LR;
    ranksep=".75";
    concentrate="true";
    node [fixedsize=true, width=1.5, style=filled, color=black];
    node [font=Helvetica, fontsize=12, fillcolor=lightgrey];
    demos_image_processing_openmp_evmc6670l_platform [shape=record,label="demos.image_processing.openmp.evmc6670l.platform|", URL="package.rel.xml"];
    node [fontsize=10, fillcolor=white];

    edge [style=solid, color=blue]

    edge [style=solid, color=lightgrey]
    xdc [shape=record,label="xdc|1, 1, 1", URL="../C:\TI\xdctools_3_23_04_60\packages\xdc\package/package.rel.svg"];
    demos_image_processing_openmp_evmc6670l_platform -> xdc;
    xdc_services_global [shape=record,label="xdc.services.global|1, 0, 0", URL="../C:\TI\xdctools_3_23_04_60\packages\xdc\services\global\package/package.rel.svg"];
    demos_image_processing_openmp_evmc6670l_platform -> xdc_services_global;
    xdc_bld [shape=record,label="xdc.bld|1, 0, 2", URL="../C:\TI\xdctools_3_23_04_60\packages\xdc\bld\package/package.rel.svg"];
    demos_image_processing_openmp_evmc6670l_platform -> xdc_bld;
    xdc_platform [shape=record,label="xdc.platform|1, 0, 1, 0", URL="../C:\TI\xdctools_3_23_04_60\packages\xdc\platform\package/package.rel.svg"];
    demos_image_processing_openmp_evmc6670l_platform -> xdc_platform;
    ti_platforms_generic [shape=record,label="ti.platforms.generic|1, 0, 0, 1", URL="../C:\TI\xdctools_3_23_04_60\packages\ti\platforms\generic\package/package.rel.svg"];
    demos_image_processing_openmp_evmc6670l_platform -> ti_platforms_generic;
    xdc_services_intern_cmd [shape=record,label="xdc.services.intern.cmd|1, 0, 0, 0", URL="../C:\TI\xdctools_3_23_04_60\packages\xdc\services\intern\cmd\package/package.rel.svg"];
    demos_image_processing_openmp_evmc6670l_platform -> xdc_services_intern_cmd;
    xdc_services_intern_gen [shape=record,label="xdc.services.intern.gen|1, 0, 0, 0", URL="../C:\TI\xdctools_3_23_04_60\packages\xdc\services\intern\gen\package/package.rel.svg"];
    demos_image_processing_openmp_evmc6670l_platform -> xdc_services_intern_gen;
    xdc_shelf [shape=record,label="xdc.shelf|1, 0, 0", URL="../C:\TI\xdctools_3_23_04_60\packages\xdc\shelf\package/package.rel.svg"];
    demos_image_processing_openmp_evmc6670l_platform -> xdc_shelf;
    xdc_services_spec [shape=record,label="xdc.services.spec|1, 0, 0, 0", URL="../C:\TI\xdctools_3_23_04_60\packages\xdc\services\spec\package/package.rel.svg"];
    demos_image_processing_openmp_evmc6670l_platform -> xdc_services_spec;
    xdc_services_intern_xsr [shape=record,label="xdc.services.intern.xsr|1, 0, 0", URL="../C:\TI\xdctools_3_23_04_60\packages\xdc\services\intern\xsr\package/package.rel.svg"];
    demos_image_processing_openmp_evmc6670l_platform -> xdc_services_intern_xsr;

    edge [style=solid, color=blue]
    xdc_services_intern_xsr -> xdc_services_global;

    edge [style=solid, color=lightgrey]
    xdc_utils_tconf [shape=record,label="xdc.utils.tconf|not found"style=rounded, ];
    xdc_services_intern_xsr -> xdc_utils_tconf;
    xdc_services_intern_xsr -> xdc_services_global;
    xdc_services_intern_xsr -> xdc_shelf;
    xdc_services_intern_xsr -> xdc_services_spec;
    xdc_services_intern_xsr -> xdc_services_intern_cmd;
    xdc_services_intern_xsr -> xdc_services_intern_gen;

    edge [style=solid, color=blue]

    edge [style=solid, color=lightgrey]

    edge [style=solid, color=blue]
    xdc_services_spec -> xdc_shelf;

    edge [style=solid, color=lightgrey]
    xdc_services_spec -> xdc_utils_tconf;
    xdc_services_spec -> xdc_services_global;
    xdc_services_spec -> xdc_shelf;
    xdc_services_spec -> xdc_services_intern_xsr;
    xdc_services_spec -> xdc_services_intern_cmd;
    xdc_services_spec -> xdc_services_intern_gen;

    edge [style=solid, color=blue]

    edge [style=solid, color=lightgrey]
    xdc_shelf -> xdc_utils_tconf;
    xdc_shelf -> xdc_services_global;
    xdc_shelf -> xdc_services_spec;
    xdc_shelf -> xdc_services_intern_xsr;
    xdc_shelf -> xdc_services_intern_cmd;
    xdc_shelf -> xdc_services_intern_gen;

    edge [style=solid, color=blue]
    xdc_services_intern_gen -> xdc_shelf;
    xdc_services_intern_gen -> xdc_services_spec;
    xdc_services_intern_gen -> xdc_services_global;
    xdc_services_intern_gen -> xdc_services_intern_xsr;

    edge [style=solid, color=lightgrey]
    xdc_services_intern_gen -> xdc_utils_tconf;
    xdc_services_intern_gen -> xdc_services_global;
    xdc_services_intern_gen -> xdc_shelf;
    xdc_services_intern_gen -> xdc_services_spec;
    xdc_services_intern_gen -> xdc_services_intern_xsr;
    xdc_services_intern_gen -> xdc_services_intern_cmd;

    edge [style=solid, color=blue]
    xdc_services_intern_cmd -> xdc_shelf;
    xdc_services_intern_cmd -> xdc_services_spec;
    xdc_services_intern_cmd -> xdc_services_global;
    xdc_services_intern_cmd -> xdc_services_intern_gen;

    edge [style=solid, color=lightgrey]
    xdc_services_intern_cmd -> xdc_utils_tconf;
    xdc_services_intern_cmd -> xdc_services_global;
    xdc_services_intern_cmd -> xdc_shelf;
    xdc_services_intern_cmd -> xdc_services_spec;
    xdc_services_intern_cmd -> xdc_services_intern_xsr;
    xdc_services_intern_cmd -> xdc_services_intern_gen;

    edge [style=solid, color=blue]
    ti_platforms_generic -> xdc_platform;

    edge [style=solid, color=lightgrey]
    ti_platforms_generic -> xdc_services_global;
    ti_targets [shape=record,label="ti.targets|1, 0, 3", URL="../C:\TI\xdctools_3_23_04_60\packages\ti\targets\package/package.rel.svg"];
    ti_platforms_generic -> ti_targets;
    gnu_targets [shape=record,label="gnu.targets|1, 0, 1", URL="../C:\TI\xdctools_3_23_04_60\packages\gnu\targets\package/package.rel.svg"];
    ti_platforms_generic -> gnu_targets;
    ti_targets_arm [shape=record,label="ti.targets.arm|2, 0, 1, 0", URL="../C:\TI\xdctools_3_23_04_60\packages\ti\targets\arm\package/package.rel.svg"];
    ti_platforms_generic -> ti_targets_arm;
    ti_targets_elf [shape=record,label="ti.targets.elf|1, 0, 0", URL="../C:\TI\xdctools_3_23_04_60\packages\ti\targets\elf\package/package.rel.svg"];
    ti_platforms_generic -> ti_targets_elf;
    ti_targets_arp32_elf [shape=record,label="ti.targets.arp32.elf|1, 0, 0", URL="../C:\TI\xdctools_3_23_04_60\packages\ti\targets\arp32\elf\package/package.rel.svg"];
    ti_platforms_generic -> ti_targets_arp32_elf;
    ti_targets_arm_elf [shape=record,label="ti.targets.arm.elf|1, 0, 0", URL="../C:\TI\xdctools_3_23_04_60\packages\ti\targets\arm\elf\package/package.rel.svg"];
    ti_platforms_generic -> ti_targets_arm_elf;
    gnu_targets_arm [shape=record,label="gnu.targets.arm|1, 0, 0, 0", URL="../C:\TI\xdctools_3_23_04_60\packages\gnu\targets\arm\package/package.rel.svg"];
    ti_platforms_generic -> gnu_targets_arm;
    microsoft_targets [shape=record,label="microsoft.targets|1, 0, 2, 0", URL="../C:\TI\xdctools_3_23_04_60\packages\microsoft\targets\package/package.rel.svg"];
    ti_platforms_generic -> microsoft_targets;
    ti_platforms_generic -> xdc_platform;
    ti_platforms_generic -> xdc_shelf;
    ti_platforms_generic -> xdc_services_spec;
    ti_platforms_generic -> xdc_services_intern_cmd;
    ti_platforms_generic -> xdc_services_intern_gen;
    ti_platforms_generic -> xdc_services_intern_xsr;

    edge [style=solid, color=blue]

    edge [style=solid, color=lightgrey]
    microsoft_targets -> xdc_services_global;
    microsoft_targets -> xdc_services_intern_xsr;
    microsoft_targets -> xdc_shelf;
    microsoft_targets -> xdc_services_intern_gen;
    microsoft_targets -> xdc_services_spec;
    microsoft_targets -> xdc_services_intern_cmd;

    edge [style=solid, color=blue]
    gnu_targets_arm -> gnu_targets;

    edge [style=solid, color=lightgrey]
    gnu_targets_arm -> xdc_services_global;
    gnu_targets_arm -> gnu_targets;
    gnu_targets_arm -> xdc_services_intern_xsr;
    gnu_targets_arm -> xdc_shelf;
    gnu_targets_arm -> xdc_services_intern_gen;
    gnu_targets_arm -> xdc_services_spec;
    gnu_targets_arm -> xdc_services_intern_cmd;

    edge [style=solid, color=blue]
    ti_targets_arm_elf -> ti_targets;

    edge [style=solid, color=lightgrey]
    ti_targets_arm_elf -> xdc_services_global;
    ti_targets_arm_elf -> ti_targets;
    ti_targets_arm_elf -> ti_targets_arm;
    ti_targets_arm_elf -> xdc_services_intern_xsr;
    ti_targets_arm_elf -> xdc_shelf;
    ti_targets_arm_elf -> xdc_services_intern_gen;
    ti_targets_arm_elf -> xdc_services_spec;
    ti_targets_arm_elf -> xdc_services_intern_cmd;

    edge [style=solid, color=blue]

    edge [style=solid, color=lightgrey]
    ti_targets_arp32_elf -> xdc_services_global;
    ti_targets_arp32_elf -> ti_targets;
    ti_targets_arp32_elf -> xdc_services_intern_xsr;
    ti_targets_arp32_elf -> xdc_shelf;
    ti_targets_arp32_elf -> xdc_services_intern_gen;
    ti_targets_arp32_elf -> xdc_services_spec;
    ti_targets_arp32_elf -> xdc_services_intern_cmd;

    edge [style=solid, color=blue]

    edge [style=solid, color=lightgrey]
    ti_targets_elf -> xdc_services_global;
    ti_targets_elf -> ti_targets;
    ti_targets_elf -> xdc_services_intern_xsr;
    ti_targets_elf -> xdc_shelf;
    ti_targets_elf -> xdc_services_intern_gen;
    ti_targets_elf -> xdc_services_spec;
    ti_targets_elf -> xdc_services_intern_cmd;

    edge [style=solid, color=blue]
    ti_targets_arm -> ti_targets;

    edge [style=solid, color=lightgrey]
    ti_targets_arm -> xdc_services_global;
    ti_targets_arm -> ti_targets;
    ti_targets_arm -> xdc_services_intern_xsr;
    ti_targets_arm -> xdc_shelf;
    ti_targets_arm -> xdc_services_intern_gen;
    ti_targets_arm -> xdc_services_spec;
    ti_targets_arm -> xdc_services_intern_cmd;

    edge [style=solid, color=blue]

    edge [style=solid, color=lightgrey]
    gnu_targets -> xdc_services_global;
    gnu_targets -> xdc_services_intern_xsr;
    gnu_targets -> xdc_shelf;
    gnu_targets -> xdc_services_intern_gen;
    gnu_targets -> xdc_services_spec;
    gnu_targets -> xdc_services_intern_cmd;

    edge [style=solid, color=blue]

    edge [style=solid, color=lightgrey]
    ti_targets -> xdc_services_global;
    ti_targets -> xdc_services_intern_xsr;
    ti_targets -> xdc_shelf;
    ti_targets -> xdc_services_intern_gen;
    ti_targets -> xdc_services_spec;
    ti_targets -> xdc_services_intern_cmd;

    edge [style=solid, color=blue]

    edge [style=solid, color=lightgrey]
    xdc_platform -> xdc_utils_tconf;
    xdc_platform -> xdc_services_global;
    xdc_platform -> xdc_shelf;
    xdc_platform -> xdc_services_spec;
    xdc_platform -> xdc_services_intern_xsr;
    xdc_platform -> xdc_services_intern_cmd;
    xdc_platform -> xdc_services_intern_gen;

    edge [style=solid, color=blue]
    xdc_bld -> xdc_services_global;
    xdc_bld -> xdc_services_intern_cmd;

    edge [style=solid, color=lightgrey]
    xdc_bld -> xdc_utils_tconf;
    xdc_bld -> xdc;
    xdc_bld -> xdc_services_global;
    xdc_bld -> xdc_shelf;
    xdc_bld -> xdc_services_spec;
    xdc_bld -> xdc_services_intern_xsr;
    xdc_bld -> xdc_services_intern_cmd;
    xdc_bld -> xdc_services_intern_gen;

    edge [style=solid, color=blue]

    edge [style=solid, color=lightgrey]
    xdc_services_global -> xdc_utils_tconf;
    xdc_services_global -> xdc_shelf;
    xdc_services_global -> xdc_services_spec;
    xdc_services_global -> xdc_services_intern_xsr;
    xdc_services_global -> xdc_services_intern_cmd;
    xdc_services_global -> xdc_services_intern_gen;

    edge [style=solid, color=blue]

    edge [style=solid, color=lightgrey]
    xdc -> xdc_utils_tconf;
    xdc -> xdc_services_global;
}
