{
	"deviceName" : "C6678",
	
	"partitions" : [
		{
			"name"			: "load-partition",
			"vaddr"			: "0x9e000000",
			"size"			: "0x1000000",
			"loadPartition" : true 
		}
	],
	
	"applications" : [
		{
			"name"			 : "image",
			"fileName"       : "../../../openmp/evmc6678l/Release/image_processing_openmp_evmc6678l.out",
			"allowedCores"   : [0,1,2,3,4,5,6,7]
		}
	],
	
	"appDeployment" : [
		"image",
		"image",
		"image",
		"image",
		"image",
		"image",
		"image",
		"image"
	]
}
