{
	"deploymentCfgFile" : "./config-files/deployment_template_evmc6678l_bypass_prelink.json",
	"LoadImageName"     : "mcip-plbp-c6678-le.bin",
	"prelinkExe"        : "prelink6x",
	"ofdTool"           : "ofd6x",
	"stripExe"          : "strip6x",
    "malApp"                : "../../../../../tools/boot_loader/mad-utils/mad-loader/bin/C6678/le/mal_app.exe",
    "nmlLoader"             : "../../../../../tools/boot_loader/mad-utils/mad-loader/bin/C6678/le/nml.exe"
}
