==============================
 Chapter 6: Topic User Guides
==============================

.. toctree::
   :maxdepth: 1

   ./secure_boot_signing
   ./keystore_provision
   ./asymmetric_key_services
