REVD
-----
CPLD1 (Multiserdes) : 00A48AE1
CPLD2 (Multiserdes) : 00A4778F

REVC
-----
CPLD1 (Multiserdes) : 00A48F92

REVB
-----
CPLD1 (Multiserdes) : 00A4869B

REVA
-----
CPLD1 (Multiserdes) : 00A486EF
CPLD2 (Multiserdes) : 00A47748
