====================================================================
REPORT FOR LIBRARY: lib/vpe_cm.a64Pe
====================================================================


************************************************************
REPORT FOR FILE: hlcnum.o64Pe
************************************************************
                          Name : Size (dec)  Size (hex)  Type
------------------------------ : ----------  ----------  ----
                         .text :        256  0x00000100  CODE 

************************************************************
REPORT FOR FILE: sfc.o64Pe
************************************************************
                          Name : Size (dec)  Size (hex)  Type
------------------------------ : ----------  ----------  ----
                         .text :        800  0x00000320  CODE 

************************************************************
REPORT FOR FILE: slmnum.o64Pe
************************************************************
                          Name : Size (dec)  Size (hex)  Type
------------------------------ : ----------  ----------  ----
                         .text :        384  0x00000180  CODE 

************************************************************
REPORT FOR FILE: nrnum.o64Pe
************************************************************
                          Name : Size (dec)  Size (hex)  Type
------------------------------ : ----------  ----------  ----
                         .text :       5056  0x000013c0  CODE 

************************************************************
REPORT FOR FILE: nrfft.o64Pe
************************************************************
                          Name : Size (dec)  Size (hex)  Type
------------------------------ : ----------  ----------  ----
                         .text :       2592  0x00000a20  CODE 

************************************************************
REPORT FOR FILE: nrops.o64Pe
************************************************************
                          Name : Size (dec)  Size (hex)  Type
------------------------------ : ----------  ----------  ----
                         .text :        512  0x00000200  CODE 

************************************************************
REPORT FOR FILE: nrffttb.o64Pe
************************************************************
                          Name : Size (dec)  Size (hex)  Type
------------------------------ : ----------  ----------  ----
           .const:_nr_ffttable :        768  0x00000300  DATA 

------------------------------------------------------------
Totals by section type
------------------------------------------------------------
    Initialized Data :        768  0x00000300
                Code :       9600  0x00002580
