      0      0      2    -10     24    -47     81   -129    200   -312    518  -1086  32701   1169   -540    322   -206    133    -84     49    -25     11     -3
      0      0      6    -28     72   -141    244   -393    609   -947   1560  -3168  32080   4009  -1780   1051   -672    434   -273    161    -85     36     -9
      0      8    -54    152   -314    557   -908   1417  -2192   3534  -6643  26408  14278  -5353   3043  -1924   1245   -791    476   -259    117    -36      0
      8    -54    149   -305    540   -879   1370  -2121   3427  -6486  27251  13128  -5033   2874  -1820   1178   -747    449   -243    109    -33      0      0
    -17     64   -147    276   -464    736  -1137   1786  -3058   7223  30795  -4820   2443  -1494    963   -620    384   -220    110    -42      8      0      0
      8    -41    108   -216    376   -607    943  -1464   2394  -4732  30893   7016  -2980   1741  -1109    718   -453    269   -143     62    -17      0      0
      0      7    -40    104   -208    362   -584    907  -1407   2304  -4568  31064   6645  -2838   1661  -1059    685   -432    256   -136     59    -16      0
