Register Name,Address,Offset,Mode 0,Mode 1,Mode 2,Mode 3,Mode 4,Mode 5,Mode 6,Mode 7,Mode 8,Mode 9
CTRL_CONF_GPMC_AD0,0x44E10800,0x0800,gpmc_ad0,mmc1_dat0_mux2,,,,,,gpio1[0],,
CTRL_CONF_GPMC_AD1,0x44E10804,0x0804,gpmc_ad1,mmc1_dat1_mux2,,,,,,gpio1[1],,
CTRL_CONF_GPMC_AD2,0x44E10808,0x0808,gpmc_ad2,mmc1_dat2_mux2,,,,,,gpio1[2],,
CTRL_CONF_GPMC_AD3,0x44E1080C,0x080c,gpmc_ad3,mmc1_dat3_mux2,,,,,,gpio1[3],,
CTRL_CONF_GPMC_AD4,0x44E10810,0x0810,gpmc_ad4,mmc1_dat4_mux1,,,,,,gpio1[4],,
CTRL_CONF_GPMC_AD5,0x44E10814,0x0814,gpmc_ad5,mmc1_dat5_mux1,,,,,,gpio1[5],,
CTRL_CONF_GPMC_AD6,0x44E10818,0x0818,gpmc_ad6,mmc1_dat6_mux1,,,,,,gpio1[6],,
CTRL_CONF_GPMC_AD7,0x44E1081C,0x081c,gpmc_ad7,mmc1_dat7_mux1,,,,,,gpio1[7],,
CTRL_CONF_GPMC_AD8,0x44E10820,0x0820,gpmc_ad8,dss_data23_mux0,mmc1_dat0_mux0,mmc2_dat4_mux1,ehrpwm2A_mux1,pr1_mii_mt0_clk_mux0,spi3_sclk_mux0,gpio0[22],spi3_cs1_mux3,gpio5[26]
CTRL_CONF_GPMC_AD9,0x44E10824,0x0824,gpmc_ad9,dss_data22_mux0,mmc1_dat1_mux0,mmc2_dat5_mux1,ehrpwm2B_mux1,pr1_mii0_col_mux0,spi3_d0_mux0,gpio0[23],,gpio5[25]
CTRL_CONF_GPMC_AD10,0x44E10828,0x0828,gpmc_ad10,dss_data21_mux0,mmc1_dat2_mux0,mmc2_dat6_mux1,ehrpwm2_tripzone_input_mux1,pr1_mii0_txen_mux0,spi3_d1_mux0,gpio0[26],,gpio5[24]
CTRL_CONF_GPMC_AD11,0x44E1082C,0x082c,gpmc_ad11,dss_data20_mux0,mmc1_dat3_mux0,mmc2_dat7_mux1,ehrpwm0_synco_mux4,pr1_mii0_txd3_mux0,spi3_cs0_mux0,gpio0[27],,gpio5[23]
CTRL_CONF_GPMC_AD12,0x44E10830,0x0830,gpmc_ad12,dss_data19_mux0,mmc1_dat4_mux0,mmc2_dat0_mux1,eQEP2A_in_mux1,pr1_mii0_txd2_mux0,pr1_pru0_gpi[10],gpio1[12],mcasp0_aclkx_mux4,pr1_pru0_gpo[10]
CTRL_CONF_GPMC_AD13,0x44E10834,0x0834,gpmc_ad13,dss_data18_mux0,mmc1_dat5_mux0,mmc2_dat1_mux1,eQEP2B_in_mux1,pr1_mii0_txd1_mux0,pr1_pru0_gpi[11],gpio1[13],mcasp0_fsx_mux4,pr1_pru0_gpo[11]
CTRL_CONF_GPMC_AD14,0x44E10838,0x0838,gpmc_ad14,dss_data17_mux0,mmc1_dat6_mux0,mmc2_dat2_mux1,eQEP2_index_mux1,pr1_mii0_txd0_mux0,pr1_pru0_gpi[16],gpio1[14],mcasp0_axr0_mux4,
CTRL_CONF_GPMC_AD15,0x44E1083C,0x083c,gpmc_ad15,dss_data16_mux0,mmc1_dat7_mux0,mmc2_dat3_mux1,eQEP2_strobe_mux1,pr1_ecap0_ecap_capin_apwm_o_mux0,,gpio1[15],mcasp0_axr1_mux4,spi3_cs1_mux2
CTRL_CONF_GPMC_A0,0x44E10840,0x0840,gpmc_a0_mux0,gmii2_txen,rgmii2_tctl,rmii2_txen,gpmc_a16_mux0,pr1_mii1_txen,ehrpwm1_tripzone_input_mux1,gpio1[16],,
CTRL_CONF_GPMC_A1,0x44E10844,0x0844,gpmc_a1_mux0,gmii2_rxdv,rgmii2_rctl,mmc2_dat0_mux0,gpmc_a17_mux0,pr1_mii1_rxdv,ehrpwm0_synco_mux1,gpio1[17],,
CTRL_CONF_GPMC_A2,0x44E10848,0x0848,gpmc_a2_mux0,gmii2_txd3,rgmii2_td3,mmc2_dat1_mux0,gpmc_a18_mux0,pr1_mii1_txd3,ehrpwm1A_mux1,gpio1[18],,
CTRL_CONF_GPMC_A3,0x44E1084C,0x084c,gpmc_a3_mux0,gmii2_txd2,rgmii2_td2,mmc2_dat2_mux0,gpmc_a19_mux0,pr1_mii1_txd2,ehrpwm1B_mux1,gpio1[19],,
CTRL_CONF_GPMC_A4,0x44E10850,0x0850,gpmc_a4_mux0,gmii2_txd1,rgmii2_td1,rmii2_txd1,gpmc_a20_mux0,pr1_mii1_txd1,eQEP1A_in_mux1,gpio1[20],,
CTRL_CONF_GPMC_A5,0x44E10854,0x0854,gpmc_a5_mux0,gmii2_txd0,rgmii2_td0,rmii2_txd0,gpmc_a21_mux0,pr1_mii1_txd0,eQEP1B_in_mux1,gpio1[21],,
CTRL_CONF_GPMC_A6,0x44E10858,0x0858,gpmc_a6_mux0,gmii2_txclk,rgmii2_tclk,mmc2_dat4_mux0,gpmc_a22_mux0,pr1_mii_mt1_clk,eQEP1_index_mux1,gpio1[22],,
CTRL_CONF_GPMC_A7,0x44E1085C,0x085c,gpmc_a7_mux0,gmii2_rxclk,rgmii2_rclk,mmc2_dat5_mux0,gpmc_a23_mux0,pr1_mii_mr1_clk,eQEP1_strobe_mux1,gpio1[23],,
CTRL_CONF_GPMC_A8,0x44E10860,0x0860,gpmc_a8_mux0,gmii2_rxd3,rgmii2_rd3,mmc2_dat6_mux0,gpmc_a24_mux0,pr1_mii1_rxd3,mcasp0_aclkx_mux3,gpio1[24],,
CTRL_CONF_GPMC_A9,0x44E10864,0x0864,gpmc_a9_mux0,gmii2_rxd2,rgmii2_rd2,mmc2_dat7_mux0,gpmc_a25_mux0,pr1_mii1_rxd2,mcasp0_fsx_mux3,gpio1[25],rmii2_crs_dv_mux1,
CTRL_CONF_GPMC_A10,0x44E10868,0x0868,gpmc_a10_mux0,gmii2_rxd1,rgmii2_rd1,rmii2_rxd1,gpmc_a26_mux0,pr1_mii1_rxd1,mcasp0_axr0_mux3,gpio1[26],,
CTRL_CONF_GPMC_A11,0x44E1086C,0x086c,gpmc_a11_mux0,gmii2_rxd0,rgmii2_rd0,rmii2_rxd0,gpmc_a27_mux0,pr1_mii1_rxd0,mcasp0_axr1_mux3,gpio1[27],,
CTRL_CONF_GPMC_WAIT0,0x44E10870,0x0870,gpmc_wait0_mux0,gmii2_crs_mux0,gpmc_csn4,rmii2_crs_dv_mux0,mmc1_sdcd_mux0,pr1_mii1_crs_mux2,uart4_rxd_mux2,gpio0[30],,gpio5[30]
CTRL_CONF_GPMC_WPN,0x44E10874,0x0874,gpmc_wpn,gmii2_rxer,gpmc_csn5,rmii2_rxer,mmc2_sdcd_mux0,pr1_mii1_rxer,uart4_txd_mux2,gpio0[31],,gpio5[31]
CTRL_CONF_GPMC_BE1N,0x44E10878,0x0878,gpmc_be1n_mux0,gmii2_col,gpmc_csn6,mmc2_dat3_mux0,gpmc_dir,pr1_mii1_col_mux0,mcasp0_aclkr_mux3,gpio1[28],,
CTRL_CONF_GPMC_CSN0,0x44E1087C,0x087c,gpmc_csn0,,,qspi_csn_mux0,,,,gpio1[29],,
CTRL_CONF_GPMC_CSN1,0x44E10880,0x0880,gpmc_csn1,gpmc_clk_mux1,mmc1_clk_mux0,pr1_edio_data_in6_mux0,pr1_edio_data_out6_mux0,pr1_pru0_gpo[8],pr1_pru0_gpi[8],gpio1[30],,
CTRL_CONF_GPMC_CSN2,0x44E10884,0x0884,gpmc_csn2,gpmc_be1n_mux1,mmc1_cmd_mux0,pr1_edio_data_in7_mux0,pr1_edio_data_out7_mux0,pr1_pru0_gpo[9],pr1_pru0_gpi[9],gpio1[31],gmii2_crs_mux1,rmii2_crs_dv_mux2
CTRL_CONF_GPMC_CSN3,0x44E10888,0x0888,gpmc_csn3,gpmc_wait0_mux1,qspi_clk_mux0,mmc2_cmd_mux0,pr1_mii0_crs_mux0,pr1_mdio_data_mux0,EMU4_mux0,gpio2[0],gmii2_crs_mux2,rmii2_crs_dv_mux3
CTRL_CONF_GPMC_CLK,0x44E1088C,0x088c,gpmc_clk_mux0,,gpmc_wait1,mmc2_clk_mux0,pr1_mii1_crs_mux0,pr1_mdio_mdclk_mux0,mcasp0_fsr_mux3,gpio2[1],,gpio0[4]
CTRL_CONF_GPMC_ADVN_ALE,0x44E10890,0x0890,gpmc_advn_ale,spi0_cs3_mux2,timer4_mux3,qspi_d0_mux0,,,,gpio2[2],,
CTRL_CONF_GPMC_OEN_REN,0x44E10894,0x0894,gpmc_oen_ren,spi0_cs2_mux2,timer7_mux3,qspi_d1_mux0,,,,gpio2[3],,
CTRL_CONF_GPMC_WEN,0x44E10898,0x0898,gpmc_wen,spi1_cs2_mux2,timer6_mux3,qspi_d2_mux0,,,,gpio2[4],,
CTRL_CONF_GPMC_BE0N_CLE,0x44E1089C,0x089c,gpmc_be0n_cle,spi1_cs3_mux2,timer5_mux3,qspi_d3_mux0,pr1_mii1_rxlink_mux0,gpmc_a5_mux2,spi3_cs1_mux0,gpio2[5],,
CTRL_CONF_DSS_DATA0,0x44E108A0,0x08a0,dss_data0,gpmc_a0_mux1,pr1_mii_mt0_clk_mux1,ehrpwm2A_mux0,,pr1_pru0_gpo[0],pr1_pru0_gpi[0],gpio2[6],,
CTRL_CONF_DSS_DATA1,0x44E108A4,0x08a4,dss_data1,gpmc_a1_mux1,pr1_mii0_txen_mux1,ehrpwm2B_mux0,,pr1_pru0_gpo[1],pr1_pru0_gpi[1],gpio2[7],,
CTRL_CONF_DSS_DATA2,0x44E108A8,0x08a8,dss_data2,gpmc_a2_mux1,pr1_mii0_txd3_mux1,ehrpwm2_tripzone_input_mux0,,pr1_pru0_gpo[2],pr1_pru0_gpi[2],gpio2[8],,
CTRL_CONF_DSS_DATA3,0x44E108AC,0x08ac,dss_data3,gpmc_a3_mux1,pr1_mii0_txd2_mux1,ehrpwm0_synco_mux2,,pr1_pru0_gpo[3],pr1_pru0_gpi[3],gpio2[9],,
CTRL_CONF_DSS_DATA4,0x44E108B0,0x08b0,dss_data4,gpmc_a4_mux1,pr1_mii0_txd1_mux1,eQEP2A_in_mux0,,pr1_pru0_gpo[4],pr1_pru0_gpi[4],gpio2[10],,
CTRL_CONF_DSS_DATA5,0x44E108B4,0x08b4,dss_data5,gpmc_a5_mux1,pr1_mii0_txd0_mux1,eQEP2B_in_mux0,,pr1_pru0_gpo[5],pr1_pru0_gpi[5],gpio2[11],,
CTRL_CONF_DSS_DATA6,0x44E108B8,0x08b8,dss_data6,gpmc_a6_mux1,pr1_edio_data_in6_mux1,eQEP2_index_mux0,pr1_edio_data_out6_mux1,pr1_pru0_gpo[6],pr1_pru0_gpi[6],gpio2[12],,
CTRL_CONF_DSS_DATA7,0x44E108BC,0x08bc,dss_data7,gpmc_a7_mux1,pr1_edio_data_in7_mux1,eQEP2_strobe_mux0,pr1_edio_data_out7_mux1,pr1_pru0_gpo[7],pr1_pru0_gpi[7],gpio2[13],,
CTRL_CONF_DSS_DATA8,0x44E108C0,0x08c0,dss_data8,gpmc_a12,ehrpwm1_tripzone_input_mux0,mcasp0_aclkx_mux1,uart5_txd_mux2,pr1_mii0_rxd3,uart2_ctsn_mux1,gpio2[14],,
CTRL_CONF_DSS_DATA9,0x44E108C4,0x08c4,dss_data9,gpmc_a13,ehrpwm0_synco_mux0,mcasp0_fsx_mux1,uart5_rxd_mux2,pr1_mii0_rxd2,uart2_rtsn_mux1,gpio2[15],,
CTRL_CONF_DSS_DATA10,0x44E108C8,0x08c8,dss_data10,gpmc_a14,ehrpwm1A_mux0,mcasp0_axr0_mux1,,pr1_mii0_rxd1,uart3_ctsn_mux1,gpio2[16],,
CTRL_CONF_DSS_DATA11,0x44E108CC,0x08cc,dss_data11,gpmc_a15,ehrpwm1B_mux0,mcasp0_ahclkr_mux1,mcasp0_axr2_mux2,pr1_mii0_rxd0,uart3_rtsn_mux1,gpio2[17],spi3_cs1_mux1,
CTRL_CONF_DSS_DATA12,0x44E108D0,0x08d0,dss_data12,gpmc_a16_mux1,eQEP1A_in_mux0,mcasp0_aclkr_mux1,mcasp0_axr2_mux3,pr1_mii0_rxlink_mux0,uart4_ctsn_mux1,gpio0[8],spi3_sclk_mux1,
CTRL_CONF_DSS_DATA13,0x44E108D4,0x08d4,dss_data13,gpmc_a17_mux1,eQEP1B_in_mux0,mcasp0_fsr_mux1,mcasp0_axr3_mux3,pr1_mii0_rxer,uart4_rtsn_mux1,gpio0[9],spi3_d0_mux1,
CTRL_CONF_DSS_DATA14,0x44E108D8,0x08d8,dss_data14,gpmc_a18_mux1,eQEP1_index_mux0,mcasp0_axr1_mux1,uart5_rxd_mux1,pr1_mii_mr0_clk,uart5_ctsn_mux1,gpio0[10],spi3_d1_mux1,
CTRL_CONF_DSS_DATA15,0x44E108DC,0x08dc,dss_data15,gpmc_a19_mux1,eQEP1_strobe_mux0,mcasp0_ahclkx_mux1,mcasp0_axr3_mux2,pr1_mii0_rxdv,uart5_rtsn_mux1,gpio0[11],spi3_cs0_mux1,
CTRL_CONF_DSS_VSYNC,0x44E108E0,0x08e0,dss_vsync,gpmc_a8_mux1,gpmc_a1_mux2,pr1_edio_data_in2,pr1_edio_data_out2,pr0_pru1_gpo[6],pr0_pru1_gpi[6],gpio2[22],,
CTRL_CONF_DSS_HSYNC,0x44E108E4,0x08e4,dss_hsync,gpmc_a9_mux1,gpmc_a2_mux2,pr1_edio_data_in3,pr1_edio_data_out3,pr0_pru1_gpo[7],pr0_pru1_gpi[7],gpio2[23],,
CTRL_CONF_DSS_PCLK,0x44E108E8,0x08e8,dss_pclk,gpmc_a10_mux1,gpmc_a3_mux2,pr1_edio_data_in4,pr1_edio_data_out4,pr0_pru1_gpo[8],pr0_pru1_gpi[8],gpio2[24],,
CTRL_CONF_DSS_AC_BIAS_EN,0x44E108EC,0x08ec,dss_ac_bias_en,gpmc_a11_mux1,gpmc_a4_mux2,pr1_edio_data_in5,pr1_edio_data_out5,pr0_pru1_gpo[9],pr0_pru1_gpi[9],gpio2[25],,
CTRL_CONF_MMC0_DAT3,0x44E108F0,0x08f0,mmc0_dat3,gpmc_a20_mux1,uart4_ctsn_mux0,timer5_mux0,uart1_dcdn_mux1,pr0_pru0_gpo[8],pr0_pru0_gpi[8],gpio2[26],,
CTRL_CONF_MMC0_DAT2,0x44E108F4,0x08f4,mmc0_dat2,gpmc_a21_mux1,uart4_rtsn_mux0,timer6_mux0,uart1_dsrn_mux1,pr0_pru0_gpo[9],pr0_pru0_gpi[9],gpio2[27],,
CTRL_CONF_MMC0_DAT1,0x44E108F8,0x08f8,mmc0_dat1,gpmc_a22_mux1,uart5_ctsn_mux0,uart3_rxd_mux2,uart1_dtrn_mux1,pr0_pru0_gpo[10],pr0_pru0_gpi[10],gpio2[28],,
CTRL_CONF_MMC0_DAT0,0x44E108FC,0x08fc,mmc0_dat0,gpmc_a23_mux1,uart5_rtsn_mux0,uart3_txd_mux2,uart1_rin_mux1,pr0_pru0_gpo[11],pr0_pru0_gpi[11],gpio2[29],,
CTRL_CONF_MMC0_CLK,0x44E10900,0x0900,mmc0_clk,gpmc_a24_mux1,uart3_ctsn_mux0,uart2_rxd_mux2,dcan1_tx_mux2,pr0_pru0_gpo[12],pr0_pru0_gpi[12],gpio2[30],,
CTRL_CONF_MMC0_CMD,0x44E10904,0x0904,mmc0_cmd,gpmc_a25_mux1,uart3_rtsn_mux0,uart2_txd_mux2,dcan1_rx_mux2,pr0_pru0_gpo[13],pr0_pru0_gpi[13],gpio2[31],,
CTRL_CONF_MII1_COL,0x44E10908,0x0908,gmii1_col,rmii2_refclk,spi1_sclk_mux1,uart5_rxd_mux0,mcasp1_axr2_mux1,mmc2_dat3_mux2,mcasp0_axr2_mux4,gpio3[0],,gpio0[0]
CTRL_CONF_MII1_CRS,0x44E1090C,0x090c,gmii1_crs,rmii1_crs_dv,spi1_d0_mux1,I2C1_SDA_mux0,mcasp1_aclkx_mux1,uart5_ctsn_mux2,uart2_rxd_mux1,gpio3[1],,
CTRL_CONF_MII1_RXERR,0x44E10910,0x0910,gmii1_rxer,rmii1_rxer,spi1_d1_mux1,I2C1_SCL_mux0,mcasp1_fsx_mux1,uart5_rtsn_mux2,uart2_txd_mux1,gpio3[2],,
CTRL_CONF_MII1_TXEN,0x44E10914,0x0914,gmii1_txen,rmii1_txen,rgmii1_tctl,timer4_mux0,mcasp1_axr0_mux1,eQEP0_index_mux1,mmc2_cmd_mux2,gpio3[3],,
CTRL_CONF_MII1_RXDV,0x44E10918,0x0918,gmii1_rxdv,,rgmii1_rctl,uart5_txd_mux1,mcasp1_aclkx_mux0,mmc2_dat0_mux2,mcasp0_aclkr_mux2,gpio3[4],,gpio0[1]
CTRL_CONF_MII1_TXD3,0x44E1091C,0x091c,gmii1_txd3,dcan0_tx_mux0,rgmii1_td3,uart4_rxd_mux0,mcasp1_fsx_mux0,mmc2_dat1_mux2,mcasp0_fsr_mux2,gpio0[16],,gpio3[11]
CTRL_CONF_MII1_TXD2,0x44E10920,0x0920,gmii1_txd2,dcan0_rx_mux0,rgmii1_td2,uart4_txd_mux0,mcasp1_axr0_mux0,mmc2_dat2_mux2,mcasp0_ahclkx_mux2,gpio0[17],,gpio3[12]
CTRL_CONF_MII1_TXD1,0x44E10924,0x0924,gmii1_txd1,rmii1_txd1,rgmii1_td1,mcasp1_fsr_mux1,mcasp1_axr1_mux0,eQEP0A_in_mux1,mmc1_cmd_mux1,gpio0[21],,
CTRL_CONF_MII1_TXD0,0x44E10928,0x0928,gmii1_txd0,rmii1_txd0,rgmii1_td0,mcasp1_axr2_mux0,mcasp1_aclkr_mux0,eQEP0B_in_mux1,mmc1_clk_mux1,gpio0[28],,
CTRL_CONF_MII1_TXCLK,0x44E1092C,0x092c,gmii1_txclk,uart2_rxd_mux0,rgmii1_tclk,mmc0_dat7,mmc1_dat0_mux1,uart1_dcdn_mux0,mcasp0_aclkx_mux2,gpio3[9],,gpio0[8]
CTRL_CONF_MII1_RXCLK,0x44E10930,0x0930,gmii1_rxclk,uart2_txd_mux0,rgmii1_rclk,mmc0_dat6,mmc1_dat1_mux1,uart1_dsrn_mux0,mcasp0_fsx_mux2,gpio3[10],,gpio0[9]
CTRL_CONF_MII1_RXD3,0x44E10934,0x0934,gmii1_rxd3,uart3_rxd_mux0,rgmii1_rd3,mmc0_dat5,mmc1_dat2_mux1,uart1_dtrn_mux0,mcasp0_axr0_mux2,gpio2[18],,gpio0[10]
CTRL_CONF_MII1_RXD2,0x44E10938,0x0938,gmii1_rxd2,uart3_txd_mux0,rgmii1_rd2,mmc0_dat4,mmc1_dat3_mux1,uart1_rin_mux0,mcasp0_axr1_mux2,gpio2[19],,gpio0[11]
CTRL_CONF_MII1_RXD1,0x44E1093C,0x093c,gmii1_rxd1,rmii1_rxd1,rgmii1_rd1,mcasp1_axr3_mux0,mcasp1_fsr_mux0,eQEP0_strobe_mux1,mmc2_clk_mux2,gpio2[20],,
CTRL_CONF_MII1_RXD0,0x44E10940,0x0940,gmii1_rxd0,rmii1_rxd0,rgmii1_rd0,mcasp1_ahclkx_mux0,mcasp1_ahclkr,mcasp1_aclkr_mux1,mcasp0_axr3_mux4,gpio2[21],,
CTRL_CONF_RMII1_REFCLK,0x44E10944,0x0944,rmii1_refclk,xdma_event_intr2_mux0,spi1_cs0_mux1,uart5_txd_mux0,mcasp1_axr3_mux1,mmc0_pow_mux0,mcasp1_ahclkx_mux1,gpio0[29],,
CTRL_CONF_MDIO_DATA,0x44E10948,0x0948,mdio_data,timer6_mux2,uart5_rxd_mux3,uart3_ctsn_mux2,mmc0_sdcd_mux2,mmc1_cmd_mux2,mmc2_cmd_mux1,gpio0[0],pr1_mdio_data_mux1,
CTRL_CONF_MDIO_CLK,0x44E1094C,0x094c,mdio_clk,timer5_mux2,uart5_txd_mux3,uart3_rtsn_mux2,mmc0_sdwp_mux2,mmc1_clk_mux2,mmc2_clk_mux1,gpio0[1],pr1_mdio_mdclk_mux1,
CTRL_CONF_SPI0_SCLK,0x44E10950,0x0950,spi0_sclk,uart2_rxd_mux3,I2C2_SDA_mux2,ehrpwm0A_mux1,pr1_uart0_cts_n_mux0,pr0_uart0_cts_n,EMU2_mux1,gpio0[2],,
CTRL_CONF_SPI0_D0,0x44E10954,0x0954,spi0_d0,uart2_txd_mux3,I2C2_SCL_mux2,ehrpwm0B_mux1,pr1_uart0_rts_n_mux0,pr0_uart0_rts_n,EMU3_mux1,gpio0[3],,
CTRL_CONF_SPI0_D1,0x44E10958,0x0958,spi0_d1,mmc1_sdwp_mux0,I2C1_SDA_mux3,ehrpwm0_tripzone_input_mux1,pr1_uart0_rxd_mux0,pr0_uart0_rxd,pr1_edio_data_out0,gpio0[4],ehrpwm1A_mux4,
CTRL_CONF_SPI0_CS0,0x44E1095C,0x095c,spi0_cs0,mmc2_sdwp_mux0,I2C1_SCL_mux3,ehrpwm0_synci_mux3,pr1_uart0_txd_mux0,pr0_uart0_txd,pr1_edio_data_out1,gpio0[5],ehrpwm1B_mux4,
CTRL_CONF_SPI0_CS1,0x44E10960,0x0960,spi0_cs1,uart3_rxd_mux1,eCAP1_in_PWM1_out_mux0,mmc0_pow_mux1,xdma_event_intr2_mux1,mmc0_sdcd_mux0,EMU4_mux1,gpio0[6],ehrpwm2A_mux2,timer0
CTRL_CONF_ECAP0_IN_PWM0_OUT,0x44E10964,0x0964,eCAP0_in_PWM0_out,uart3_txd_mux1,spi1_cs1_mux1,pr1_ecap0_ecap_capin_apwm_o_mux1,spi1_sclk_mux0,mmc0_sdwp_mux0,xdma_event_intr2_mux2,gpio0[7],ehrpwm2B_mux2,timer1
CTRL_CONF_UART0_CTSN,0x44E10968,0x0968,uart0_ctsn,uart4_rxd_mux1,dcan1_tx_mux0,I2C1_SDA_mux1,spi1_d0_mux0,timer7_mux0,pr1_edc_sync0_out,gpio1[8],,
CTRL_CONF_UART0_RTSN,0x44E1096C,0x096c,uart0_rtsn,uart4_txd_mux1,dcan1_rx_mux0,I2C1_SCL_mux1,spi1_d1_mux0,spi1_cs0_mux2,pr1_edc_sync1_out,gpio1[9],,
CTRL_CONF_UART0_RXD,0x44E10970,0x0970,uart0_rxd,spi1_cs0_mux3,dcan0_tx_mux1,I2C2_SDA_mux1,eCAP2_in_PWM2_out_mux0,pr0_pru1_gpo[4],pr0_pru1_gpi[4],gpio1[10],,
CTRL_CONF_UART0_TXD,0x44E10974,0x0974,uart0_txd,spi1_cs1_mux3,dcan0_rx_mux1,I2C2_SCL_mux1,eCAP1_in_PWM1_out_mux1,pr0_pru1_gpo[5],pr0_pru1_gpi[5],gpio1[11],,
CTRL_CONF_UART1_CTSN,0x44E10978,0x0978,uart1_ctsn,timer6_mux1,dcan0_tx_mux2,I2C2_SDA_mux0,spi1_cs0_mux0,pr1_uart0_cts_n_mux1,pr1_edc_latch0_in,gpio0[12],,
CTRL_CONF_UART1_RTSN,0x44E1097C,0x097c,uart1_rtsn,timer5_mux1,dcan0_rx_mux2,I2C2_SCL_mux0,spi1_cs1_mux0,pr1_uart0_rts_n_mux1,pr1_edc_latch1_in,gpio0[13],,
CTRL_CONF_UART1_RXD,0x44E10980,0x0980,uart1_rxd,mmc1_sdwp_mux1,dcan1_tx_mux1,I2C1_SDA_mux2,,pr1_uart0_rxd_mux1,pr1_pru0_gpi[16],gpio0[14],,
CTRL_CONF_UART1_TXD,0x44E10984,0x0984,uart1_txd,mmc2_sdwp_mux1,dcan1_rx_mux1,I2C1_SCL_mux2,,pr1_uart0_txd_mux1,pr1_pru0_gpi[16],gpio0[15],,
CTRL_CONF_I2C0_SDA,0x44E10988,0x0988,I2C0_SDA,timer4_mux2,uart2_ctsn_mux0,eCAP2_in_PWM2_out_mux2,uart2_ckx_mux1,,,gpio3[5],,
CTRL_CONF_I2C0_SCL,0x44E1098C,0x098c,I2C0_SCL,timer7_mux2,uart2_rtsn_mux0,eCAP1_in_PWM1_out_mux2,uart3_ckx_mux1,,,gpio3[6],,
CTRL_CONF_MCASP0_ACLKX,0x44E10990,0x0990,mcasp0_aclkx_mux0,ehrpwm0A_mux0,spi0_cs3_mux0,spi1_sclk_mux2,mmc0_sdcd_mux1,pr0_pru0_gpo[0],pr0_pru0_gpi[0],gpio3[14],,
CTRL_CONF_MCASP0_FSX,0x44E10994,0x0994,mcasp0_fsx_mux0,ehrpwm0B_mux0,spi1_cs2_mux0,spi1_d0_mux2,mmc1_sdcd_mux1,pr0_pru0_gpo[1],pr0_pru0_gpi[1],gpio3[15],,
CTRL_CONF_MCASP0_AXR0,0x44E10998,0x0998,mcasp0_axr0_mux0,ehrpwm0_tripzone_input_mux0,spi1_cs3_mux0,spi1_d1_mux2,mmc2_sdcd_mux1,pr0_pru0_gpo[2],pr0_pru0_gpi[2],gpio3[16],,
CTRL_CONF_MCASP0_AHCLKR,0x44E1099C,0x099c,mcasp0_ahclkr_mux0,ehrpwm0_synci_mux0,mcasp0_axr2_mux0,spi1_cs0_mux4,eCAP2_in_PWM2_out_mux1,pr0_pru0_gpo[3],pr0_pru0_gpi[3],gpio3[17],,
CTRL_CONF_MCASP0_ACLKR,0x44E109A0,0x09a0,mcasp0_aclkr_mux0,eQEP0A_in_mux0,mcasp0_axr2_mux1,mcasp1_aclkx_mux2,mmc0_sdwp_mux1,pr0_pru0_gpo[4],pr0_pru0_gpi[4],gpio3[18],,gpio0[18]
CTRL_CONF_MCASP0_FSR,0x44E109A4,0x09a4,mcasp0_fsr_mux0,eQEP0B_in_mux0,mcasp0_axr3_mux1,mcasp1_fsx_mux2,EMU2_mux2,pr0_pru0_gpo[5],pr0_pru0_gpi[5],gpio3[19],,gpio0[19]
CTRL_CONF_MCASP0_AXR1,0x44E109A8,0x09a8,mcasp0_axr1_mux0,eQEP0_index_mux0,,mcasp1_axr0_mux2,EMU3_mux2,pr0_pru0_gpo[6],pr0_pru0_gpi[6],gpio3[20],,gpio0[2]
CTRL_CONF_MCASP0_AHCLKX,0x44E109AC,0x09ac,mcasp0_ahclkx_mux0,eQEP0_strobe_mux0,mcasp0_axr3_mux0,mcasp1_axr1_mux1,EMU4_mux2,pr0_pru0_gpo[7],pr0_pru0_gpi[7],gpio3[21],,gpio0[3]
CTRL_CONF_CAM0_HD,0x44E109B0,0x09b0,cam0_hd,,dss_data23_mux1,pr1_edio_sof_mux2,spi2_cs1_mux0,EMU10_mux1,EMU2_mux3,gpio4[0],,
CTRL_CONF_CAM0_VD,0x44E109B4,0x09b4,cam0_vd,,dss_data22_mux1,pr1_edio_outvalid,spi2_d1_mux0,EMU11_mux1,EMU3_mux3,gpio4[1],,
CTRL_CONF_CAM0_FIELD,0x44E109B8,0x09b8,cam0_field,,dss_data21_mux1,cam0_data10_mux1,spi2_sclk_mux0,cam1_data10_mux1,EMU4_mux3,gpio4[2],,
CTRL_CONF_CAM0_WEN,0x44E109BC,0x09bc,cam0_wen,,dss_data20_mux1,cam0_data11_mux1,spi2_d0_mux0,cam1_data11_mux1,EMU5,gpio4[3],,
CTRL_CONF_CAM0_PCLK,0x44E109C0,0x09c0,cam0_pclk,,dss_data19_mux1,pr0_pru0_gpo[14],spi2_cs0_mux0,pr0_pru0_gpi[14],EMU6,gpio4[4],I2C2_SDA_mux4,
CTRL_CONF_CAM0_DATA8,0x44E109C4,0x09c4,cam0_data8,,dss_data18_mux1,pr0_pru0_gpo[15],spi2_cs2_mux0,pr0_pru0_gpi[15],EMU7,gpio4[5],I2C2_SCL_mux4,
CTRL_CONF_CAM0_DATA9,0x44E109C8,0x09c8,cam0_data9,,dss_data17_mux1,pr0_pru0_gpo[16],spi2_cs3_mux0,pr0_pru0_gpi[16],EMU8,gpio4[6],,
CTRL_CONF_CAM1_DATA9,0x44E109CC,0x09cc,cam1_data9_mux0,uart3_ckx_mux2,dss_data16_mux1,pr0_pru0_gpo[17],spi2_cs3_mux1,pr0_pru0_gpi[17],EMU9,gpio4[7],uart0_ctsn_mux1,
CTRL_CONF_CAM1_DATA8,0x44E109D0,0x09d0,cam1_data8_mux0,xdma_event_intr3,spi0_cs2_mux1,pr0_pru1_gpo[0],spi2_d0_mux1,pr0_pru1_gpi[0],EMU10_mux0,gpio4[8],uart0_rtsn_mux1,
CTRL_CONF_CAM1_HD,0x44E109D4,0x09d4,cam1_hd,xdma_event_intr4,spi0_cs3_mux1,pr0_pru1_gpo[1],spi2_cs0_mux1,pr0_pru1_gpi[1],ehrpwm0A_mux2,gpio4[9],,
CTRL_CONF_CAM1_VD,0x44E109D8,0x09d8,cam1_vd,xdma_event_intr5,spi1_cs2_mux1,pr0_pru1_gpo[2],spi2_cs2_mux1,pr0_pru1_gpi[2],ehrpwm0B_mux2,gpio4[10],,
CTRL_CONF_CAM1_PCLK,0x44E109DC,0x09dc,cam1_pclk,xdma_event_intr6,spi1_cs3_mux1,pr0_pru1_gpo[3],spi2_sclk_mux1,pr0_pru1_gpi[3],ehrpwm1A_mux2,gpio4[11],,
CTRL_CONF_CAM1_FIELD,0x44E109E0,0x09e0,cam1_field,xdma_event_intr7,ext_hw_trigger_mux1,cam0_data10_mux0,spi2_cs1_mux1,cam1_data10_mux0,ehrpwm1B_mux2,gpio4[12],ehrpwm3A_mux1,
CTRL_CONF_CAM1_WEN,0x44E109E4,0x09e4,cam1_wen_mux0,xdma_event_intr8,pr1_edio_sof_mux1,cam0_data11_mux0,spi2_d1_mux1,cam1_data11_mux0,EMU11_mux0,gpio4[13],ehrpwm3B_mux1,
CTRL_CONF_CAM1_DATA0,0x44E109E8,0x09e8,cam1_data0,uart1_rxd_mux1,spi3_d0_mux2,I2C2_SDA_mux3,,,ehrpwm0_tripzone_input_mux2,gpio4[14],,
CTRL_CONF_CAM1_DATA1,0x44E109EC,0x09ec,cam1_data1,uart1_txd_mux1,spi3_d1_mux2,I2C2_SCL_mux3,,,ehrpwm0_synci_mux2,gpio4[15],,
CTRL_CONF_CAM1_DATA2,0x44E109F0,0x09f0,cam1_data2,uart1_ctsn_mux1,spi3_cs0_mux2,mmc2_clk_mux3,pr0_pru1_gpo[10],pr0_pru1_gpi[10],ehrpwm1_tripzone_input_mux2,gpio4[16],,
CTRL_CONF_CAM1_DATA3,0x44E109F4,0x09f4,cam1_data3,uart1_rtsn_mux1,spi3_sclk_mux2,mmc2_cmd_mux3,pr0_pru1_gpo[11],pr0_pru1_gpi[11],pr1_edc_latch0_in,gpio4[17],,
CTRL_CONF_CAM1_DATA4,0x44E109F8,0x09f8,cam1_data4,uart1_rin_mux2,uart2_rxd_mux4,mmc2_dat0_mux3,pr0_pru1_gpo[12],pr0_pru1_gpi[12],pr1_edc_latch1_in,gpio4[18],uart0_dcdn,
CTRL_CONF_CAM1_DATA5,0x44E109FC,0x09fc,cam1_data5,uart1_dsrn_mux2,uart2_txd_mux4,mmc2_dat1_mux3,pr0_pru1_gpo[13],pr0_pru1_gpi[13],pr1_edio_latch_in,gpio4[19],,
CTRL_CONF_CAM1_DATA6,0x44E10A00,0x0a00,cam1_data6,uart1_dcdn_mux2,uart2_ctsn_mux2,mmc2_dat2_mux3,pr0_pru1_gpo[14],pr0_pru1_gpi[14],pr1_edio_data_in0,gpio4[20],,
CTRL_CONF_CAM1_DATA7,0x44E10A04,0x0a04,cam1_data7,uart1_dtrn_mux2,uart2_rtsn_mux2,mmc2_dat3_mux3,pr0_pru1_gpo[15],pr0_pru1_gpi[15],pr1_edio_data_in1,gpio4[21],,
CTRL_CONF_CAM0_DATA0,0x44E10A08,0x0a08,cam0_data0,,cam1_data9_mux1,I2C1_SDA_mux4,pr0_pru1_gpo[16],pr0_pru1_gpi[16],ehrpwm0_synco_mux3,gpio5[19],,
CTRL_CONF_CAM0_DATA1,0x44E10A0C,0x0a0c,cam0_data1,,cam1_data8_mux1,I2C1_SCL_mux4,pr0_pru1_gpo[17],pr0_pru1_gpi[17],ehrpwm3_synco,gpio5[20],,
CTRL_CONF_CAM0_DATA2,0x44E10A10,0x0a10,cam0_data2,mmc1_clk_mux3,cam1_data10_mux2,qspi_clk_mux1,,,,gpio4[24],,
CTRL_CONF_CAM0_DATA3,0x44E10A14,0x0a14,cam0_data3,mmc1_cmd_mux3,cam1_data11_mux2,qspi_csn_mux1,,,,gpio4[25],,
CTRL_CONF_CAM0_DATA4,0x44E10A18,0x0a18,cam0_data4,mmc1_dat0_mux3,cam1_wen_mux1,qspi_d0_mux1,,,ehrpwm3A_mux0,gpio4[26],,
CTRL_CONF_CAM0_DATA5,0x44E10A1C,0x0a1c,cam0_data5,mmc1_dat1_mux3,uart1_ckx_mux0,qspi_d1_mux1,,,ehrpwm3B_mux0,gpio4[27],,
CTRL_CONF_CAM0_DATA6,0x44E10A20,0x0a20,cam0_data6,mmc1_dat2_mux3,uart2_ckx_mux0,qspi_d2_mux1,,,ehrpwm1A_mux3,gpio4[28],,
CTRL_CONF_CAM0_DATA7,0x44E10A24,0x0a24,cam0_data7,mmc1_dat3_mux3,uart3_ckx_mux0,qspi_d3_mux1,,,ehrpwm1B_mux3,gpio4[29],,
CTRL_CONF_UART3_RXD,0x44E10A28,0x0a28,uart3_rxd_mux3,,,,pr0_pru0_gpo[18],pr0_pru0_gpi[18],ehrpwm4A,gpio5[2],,
CTRL_CONF_UART3_TXD,0x44E10A2C,0x0a2c,uart3_txd_mux3,,,,pr0_pru0_gpo[19],pr0_pru0_gpi[19],ehrpwm4B,gpio5[3],,
CTRL_CONF_UART3_CTSN,0x44E10A30,0x0a30,uart3_ctsn_mux3,,spi4_cs1,,pr0_pru1_gpo[18],pr0_pru1_gpi[18],ehrpwm5A,gpio5[0],,
CTRL_CONF_UART3_RTSN,0x44E10A34,0x0a34,uart3_rtsn_mux3,hdq_sio_mux0,,,pr0_pru1_gpo[19],pr0_pru1_gpi[19],ehrpwm5B,gpio5[1],,
CTRL_CONF_GPIO5_8,0x44E10A38,0x0a38,,,,,,pr1_mii0_col_mux1,,gpio5[8],,
CTRL_CONF_GPIO5_9,0x44E10A3C,0x0a3c,,,,,,pr1_mii1_col_mux1,,gpio5[9],,
CTRL_CONF_GPIO5_10,0x44E10A40,0x0a40,,I2C1_SCL_mux6,,,,pr1_mii0_crs_mux1,,gpio5[10],,
CTRL_CONF_GPIO5_11,0x44E10A44,0x0a44,,,,,,pr1_mii1_crs_mux1,,gpio5[11],,
CTRL_CONF_GPIO5_12,0x44E10A48,0x0a48,,I2C1_SDA_mux6,,,,pr1_mii0_rxlink_mux1,,gpio5[12],,
CTRL_CONF_GPIO5_13,0x44E10A4C,0x0a4c,,,,,,pr1_mii1_rxlink_mux1,,gpio5[13],,
CTRL_CONF_SPI4_SCLK,0x44E10A50,0x0a50,spi4_sclk,,,,,,ehrpwm0_synci_mux1,gpio5[4],,
CTRL_CONF_SPI4_D0,0x44E10A54,0x0a54,spi4_d0,,,,,,ehrpwm3_synci,gpio5[5],,
CTRL_CONF_SPI4_D1,0x44E10A58,0x0a58,spi4_d1,,,,,,ehrpwm0_tripzone_input_mux3,gpio5[6],,
CTRL_CONF_SPI4_CS0,0x44E10A5C,0x0a5c,spi4_cs0,,,,,,ehrpwm3_tripzone_input,gpio5[7],,
CTRL_CONF_SPI2_SCLK,0x44E10A60,0x0a60,spi2_sclk_mux2,I2C1_SCL_mux5,,,,,ehrpwm4_tripzone_input,gpio3[24],,gpio0[22]
CTRL_CONF_SPI2_D0,0x44E10A64,0x0a64,spi2_d0_mux2,,,,,,ehrpwm5_tripzone_input,gpio3[22],,gpio0[20]
CTRL_CONF_SPI2_D1,0x44E10A68,0x0a68,spi2_d1_mux2,,,,,,ehrpwm1_tripzone_input_mux3,gpio3[23],,gpio0[21]
CTRL_CONF_SPI2_CS0,0x44E10A6C,0x0a6c,spi2_cs0_mux2,I2C1_SDA_mux5,,,,,ehrpwm2_tripzone_input_mux2,gpio3[25],,gpio0[23]
CTRL_CONF_XDMA_EVT_INTR0,0x44E10A70,0x0a70,xdma_event_intr0,ext_hw_trigger_mux0,timer4_mux1,clkout1,spi1_cs1_mux2,pr1_pru0_gpi[16],EMU2_mux0,gpio0[19],pr1_mdio_data_mux2,gpio5[28]
CTRL_CONF_XDMA_EVT_INTR1,0x44E10A74,0x0a74,xdma_event_intr1,spi0_cs2_mux0,tclkin,clkout2,timer7_mux1,pr1_pru0_gpi[16],EMU3_mux0,gpio0[20],pr1_mdio_mdclk_mux2,gpio5[29]
CTRL_CONF_CLKREQ,0x44E10A78,0x0a78,clkreq,,,,,,,gpio0[24],,
CTRL_CONF_NRESETIN_OUT,0x44E10A7C,0x0a7c,nRESETIN_OUT,,,,,,,,,
CTRL_CONF_NNMI,0x44E10A84,0x0a84,nNMI,,,,,,,,,
CTRL_CONF_TMS,0x44E10A90,0x0a90,TMS,,,,,,,,,
CTRL_CONF_TDI,0x44E10A94,0x0a94,TDI,,,,,,,,,
CTRL_CONF_TDO,0x44E10A98,0x0a98,TDO,,,,,,,,,
CTRL_CONF_TCK,0x44E10A9C,0x0a9c,TCK,,,,,,,,,
CTRL_CONF_NTRST,0x44E10AA0,0x0aa0,nTRST,,,,,,,,,
CTRL_CONF_EMU0,0x44E10AA4,0x0aa4,EMU0,,,,,,,gpio3[7],,
CTRL_CONF_EMU1,0x44E10AA8,0x0aa8,EMU1,,,,,,,gpio3[8],,
CTRL_CONF_OSC1_IN,0x44E10AAC,0x0aac,OSC1_IN,,,,,,,,,
CTRL_CONF_OSC1_OUT,0x44E10AB0,0x0ab0,OSC1_OUT,,,,,,,,,
CTRL_CONF_RTC_PORZ,0x44E10AB4,0x0ab4,RTC_porz,,,,,,,,,
CTRL_CONF_EXT_WAKEUP0,0x44E10AB8,0x0ab8,EXT_WAKEUP0,,,,,,,,,
CTRL_CONF_PMIC_POWER_EN0,0x44E10ABC,0x0abc,PMIC_POWER_EN0,,,,,,,,,
CTRL_CONF_USB0_DRVVBUS,0x44E10AC0,0x0ac0,USB0_DRVVBUS,,,,,,,gpio0[18],,gpio5[27]
CTRL_CONF_USB1_DRVVBUS,0x44E10AC4,0x0ac4,USB1_DRVVBUS,,,,,,,gpio3[13],,gpio0[25]
