=====log time[2020-10-21 | 10:39:06]=====
INFO[10:39:6:43] Current directory is C:\SimpleLink\Projects\SEM OA7000\OA7000_release_to_TI\release\mftfw_tools 
INFO[10:39:6:43] Current directory is C:\SimpleLink\Projects\SEM OA7000\OA7000_release_to_TI\release\mftfw_tools 
WARRING[10:39:6:79] file: .\\mftfw\\oa7000s\\sign_pubkey is not exist!
INFO[10:39:6:265] btn.ini file : C:\SimpleLink\Projects\SEM OA7000\OA7000_release_to_TI\release\mftfw_tools\btn.ini
INFO[10:39:6:281] output dir: C:\SimpleLink\Projects\SEM OA7000\OA7000_release_to_TI\release\mftfw_tools\output\
INFO[10:39:6:300] board setting dir: C:\SimpleLink\Projects\SEM OA7000\OA7000_release_to_TI\release\mftfw_tools\lib\
INFO[10:39:6:309] prj name : easycam_ref_fast
INFO[10:39:6:457] The MFT tool version is 1.82575.16764
INFO[10:39:6:549] Page 1
INFO[10:39:6:623] windows system version(1):10.0
INFO[10:39:6:634] libusb start
INFO[10:39:6:634] thread_ovusb here
INFO[10:39:6:644] OVUSB thread start: pid:35792/41152256
INFO[10:39:18:428] mftfw.bin: C:\SimpleLink\Projects\SEM OA7000\OA7000_release_to_TI\v11sept\mftfw.bin
INFO[10:39:18:444] prj_cfg.txt: C:\SimpleLink\Projects\SEM OA7000\OA7000_release_to_TI\release\mftfw_tools\prj_cfg.rd7000s.txt
INFO[10:39:18:524] uboot info[MPUFW-0]:.\mft_bootloader.bin, , -1, -1, 0, 0
INFO[10:39:18:546] usb boot connect hub -1, port -1, pid 1805
INFO[10:39:18:556] usb dev info 0x5a9, 1805, drvtyp winuprint
INFO[10:39:18:561] find usb device(0):5a9, 1805, 1
INFO[10:39:18:571] usb boot connected
INFO[10:39:18:580] This is chip OA7000, id 7000.
INFO[10:39:18:585] usb boot rd stat...
INFO[10:39:18:592] usb boot ready, not check security(3).
INFO[10:39:18:602] usb boot will wrt reset reg(0)
INFO[10:39:18:607] download file(bulk): .\mft_bootloader.bin, address: 0x10000000
INFO[10:39:18:988] total download 69976 bytes from .\mft_bootloader.bin
INFO[10:39:18:995] boot successful!
INFO[10:39:19:240] PID 0x1805 detached
INFO[10:39:19:436] usb cali connect hub -1, port -1, pid b805
INFO[10:39:19:441] usb dev info 0x5a9, b805, drvtyp winuprint
INFO[10:39:19:450] find usb device(0):5a9, b805, 1
INFO[10:39:19:454] libovc usb connect
INFO[10:39:21:93] DDR init pass!
WARRING[10:39:21:434] winup cali ctl wrt err 31(A device attached to the system is not functioning.
)
WARRING[10:39:21:452] sccb write error -2
INFO[10:39:21:458] thread_cali: burn fw2 success
INFO[10:39:21:616] PID 0xb805 detached
INFO[10:39:21:621] libovc usb disconnect
INFO[10:39:21:633] usb disconnect
INFO[10:39:21:827] usb cali connect hub -1, port -1, pid b805
INFO[10:39:21:835] usb dev info 0x5a9, b805, drvtyp winuprint
INFO[10:39:21:842] find usb device(0):5a9, b805, 1
INFO[10:39:21:846] libovc usb connect
INFO[10:39:21:892] Device USB connected
INFO[10:39:21:896] the mftfw.bin version is 
INFO[10:39:21:910] mftfw.bin is new version, JPEG MODE CMD is 0x08
INFO[10:39:21:931] button_enable: mic volume=58dB
INFO[10:39:21:945] button_enable: mic volume=4dB
INFO[10:39:56:955] selected single bin file : C:\SimpleLink\Projects\SEM OA7000\OA7000_release_to_TI\VxxOct\picturequality\SINGLE.bin
INFO[10:40:41:888] quit
