{
    "version": "1.3.8",
    "settings": {
        "configurationList": [
            {
                "blocksList": [
                    {
                        "blockName": "PRE_SHUTDOWN - Dev 1",
                        "commands": [
                            {
                                "book": "0",
                                "page": "0",
                                "register": "02",
                                "mask": "ff",
                                "data": "e",
                                "delay": "",
                                "$$hashKey": "033"
                            }
                        ],
                        "blockType": "PRE_SHUTDOWN",
                        "deviceName": "Dev 1 - TAS2562",
                        "deviceValue": 0,
                        "deviceShortName": ""
                    },
                    {
                        "blockName": "PRE_POWER_UP - Dev 1",
                        "commands": [
                            {
                                "book": "0",
                                "page": "01",
                                "register": "02",
                                "mask": "1e",
                                "data": "0",
                                "delay": "",
                                "$$hashKey": "05Y"
                            },
                            {
                                "book": "0",
                                "page": "0",
                                "register": "06",
                                "mask": "ff",
                                "data": "13",
                                "delay": "",
                                "$$hashKey": "05Z"
                            },
                            {
                                "book": "0",
                                "page": "0",
                                "register": "08",
                                "mask": "ff",
                                "data": "0",
                                "delay": "",
                                "$$hashKey": "060"
                            },
                            {
                                "book": "0",
                                "page": "0",
                                "register": "0c",
                                "mask": "ff",
                                "data": "44",
                                "delay": "",
                                "$$hashKey": "061"
                            },
                            {
                                "book": "0",
                                "page": "0",
                                "register": "0b",
                                "mask": "ff",
                                "data": "46",
                                "delay": "",
                                "$$hashKey": "062"
                            },
                            {
                                "book": "0",
                                "page": "0",
                                "register": "0d",
                                "mask": "ff",
                                "data": "04",
                                "delay": "",
                                "comments": "",
                                "$$hashKey": "063"
                            },
                            {
                                "book": "0",
                                "page": "0",
                                "register": "30",
                                "mask": "ff",
                                "data": "99",
                                "delay": "",
                                "$$hashKey": "064"
                            },
                            {
                                "book": "0",
                                "page": "0",
                                "register": "0a",
                                "mask": "ff",
                                "data": "f1",
                                "delay": "",
                                "$$hashKey": "065"
                            },
                            {
                                "book": "0",
                                "page": "0",
                                "register": "41",
                                "mask": "ff",
                                "data": "41",
                                "delay": "",
                                "$$hashKey": "066"
                            },
                            {
                                "book": "0",
                                "page": "0",
                                "register": "42",
                                "mask": "ff",
                                "data": "F8",
                                "delay": "",
                                "comments": "",
                                "$$hashKey": "067"
                            },
                            {
                                "book": "0",
                                "page": "0",
                                "register": "07",
                                "mask": "ff",
                                "data": "2",
                                "delay": "",
                                "$$hashKey": "068"
                            },
                            {
                                "book": "0",
                                "page": "0",
                                "register": "02",
                                "mask": "ff",
                                "data": "0",
                                "delay": "",
                                "$$hashKey": "069"
                            }
                        ],
                        "blockType": "PRE_POWER_UP",
                        "deviceName": "Dev 1 - TAS2562",
                        "deviceValue": 1,
                        "deviceShortName": ""
                    }
                ],
                "configName": "00-Music 16bit-16kHz-4slot",
                "blockTypeValues": {
                    "COEFF": "0x01",
                    "POST_POWER_UP": "0x02",
                    "PRE_SHUTDOWN": "0x03",
                    "PRE_POWER_UP": "0x04",
                    "POST_SHUTDOWN": "0x05"
                },
                "subBlockTypeValues": {
                    "SINGLE_BYTE_WRITES": "0x01",
                    "BURST_WRITES": "0x02",
                    "DELAY": "0x03",
                    "FIELD_WRITES": "0x04"
                },
                "$$hashKey": "00Z"
            },
            {
                "blocksList": [
                    {
                        "blockName": "PRE_SHUTDOWN - Dev 1",
                        "commands": [
                            {
                                "book": "0",
                                "page": "0",
                                "register": "02",
                                "mask": "ff",
                                "data": "e",
                                "delay": "",
                                "$$hashKey": "04M"
                            }
                        ],
                        "blockType": "PRE_SHUTDOWN",
                        "deviceName": "Dev 1 - TAS2562",
                        "deviceValue": 0,
                        "deviceShortName": ""
                    },
                    {
                        "blockName": "PRE_POWER_UP - Dev 1",
                        "commands": [
                            {
                                "book": "0",
                                "page": "01",
                                "register": "02",
                                "mask": "1e",
                                "data": "0",
                                "delay": "",
                                "$$hashKey": "04P"
                            },
                            {
                                "book": "0",
                                "page": "0",
                                "register": "06",
                                "mask": "ff",
                                "data": "09",
                                "delay": "",
                                "comments": "",
                                "$$hashKey": "04Q"
                            },
                            {
                                "book": "0",
                                "page": "0",
                                "register": "03",
                                "mask": "ff",
                                "data": "13",
                                "delay": "",
                                "$$hashKey": "04R"
                            },
                            {
                                "book": "0",
                                "page": "0",
                                "register": "41",
                                "mask": "ff",
                                "data": "41",
                                "delay": "",
                                "$$hashKey": "04S"
                            },
                            {
                                "book": "0",
                                "page": "0",
                                "register": "42",
                                "mask": "ff",
                                "data": "f8",
                                "delay": "",
                                "comments": "",
                                "$$hashKey": "04T"
                            },
                            {
                                "book": "0",
                                "page": "0",
                                "register": "08",
                                "mask": "ff",
                                "data": "0",
                                "delay": "",
                                "$$hashKey": "04U"
                            },
                            {
                                "book": "0",
                                "page": "0",
                                "register": "0c",
                                "mask": "ff",
                                "data": "44",
                                "delay": "",
                                "$$hashKey": "04V"
                            },
                            {
                                "book": "0",
                                "page": "0",
                                "register": "0b",
                                "mask": "ff",
                                "data": "46",
                                "delay": "",
                                "$$hashKey": "04W"
                            },
                            {
                                "book": "0",
                                "page": "0",
                                "register": "0D",
                                "mask": "ff",
                                "data": "04",
                                "delay": "",
                                "comments": "",
                                "$$hashKey": "04X"
                            },
                            {
                                "book": "0",
                                "page": "0",
                                "register": "30",
                                "mask": "ff",
                                "data": "99",
                                "delay": "",
                                "$$hashKey": "04Y"
                            },
                            {
                                "book": "0",
                                "page": "0",
                                "register": "0a",
                                "mask": "ff",
                                "data": "f1",
                                "delay": "",
                                "$$hashKey": "04Z"
                            },
                            {
                                "book": "0",
                                "page": "0",
                                "register": "07",
                                "mask": "ff",
                                "data": "2",
                                "delay": "",
                                "$$hashKey": "050"
                            },
                            {
                                "book": "0",
                                "page": "0",
                                "register": "02",
                                "mask": "ff",
                                "data": "0",
                                "delay": "",
                                "$$hashKey": "051"
                            }
                        ],
                        "blockType": "PRE_POWER_UP",
                        "deviceName": "Dev 1 - TAS2562",
                        "deviceValue": 1,
                        "deviceShortName": ""
                    }
                ],
                "configName": "01-calibration-auto-rate-16bit",
                "blockTypeValues": {
                    "COEFF": "0x01",
                    "POST_POWER_UP": "0x02",
                    "PRE_SHUTDOWN": "0x03",
                    "PRE_POWER_UP": "0x04",
                    "POST_SHUTDOWN": "0x05"
                },
                "subBlockTypeValues": {
                    "SINGLE_BYTE_WRITES": "0x01",
                    "BURST_WRITES": "0x02",
                    "DELAY": "0x03",
                    "FIELD_WRITES": "0x04"
                },
                "$$hashKey": "010"
            },
            {
                "blocksList": [
                    {
                        "blockName": "PRE_SHUTDOWN - Dev 1",
                        "commands": [
                            {
                                "book": "0",
                                "page": "0",
                                "register": "02",
                                "mask": "ff",
                                "data": "e",
                                "delay": "",
                                "$$hashKey": "07H"
                            }
                        ],
                        "blockType": "PRE_SHUTDOWN",
                        "deviceName": "Dev 1 - TAS2562",
                        "deviceValue": 0,
                        "deviceShortName": ""
                    },
                    {
                        "blockName": "PRE_POWER_UP - Dev 1",
                        "commands": [
                            {
                                "book": "0",
                                "page": "01",
                                "register": "02",
                                "mask": "1e",
                                "data": "0",
                                "delay": "",
                                "$$hashKey": "0AN"
                            },
                            {
                                "book": "0",
                                "page": "0",
                                "register": "06",
                                "mask": "ff",
                                "data": "13",
                                "delay": "",
                                "comments": "",
                                "$$hashKey": "0AO"
                            },
                            {
                                "book": "0",
                                "page": "0",
                                "register": "03",
                                "mask": "ff",
                                "data": "13",
                                "delay": "",
                                "$$hashKey": "0AP"
                            },
                            {
                                "book": "0",
                                "page": "0",
                                "register": "41",
                                "mask": "ff",
                                "data": "41",
                                "delay": "",
                                "$$hashKey": "0AQ"
                            },
                            {
                                "book": "0",
                                "page": "0",
                                "register": "42",
                                "mask": "ff",
                                "data": "f8",
                                "delay": "",
                                "comments": "",
                                "$$hashKey": "0AR"
                            },
                            {
                                "book": "0",
                                "page": "0",
                                "register": "08",
                                "mask": "ff",
                                "data": "0",
                                "delay": "",
                                "$$hashKey": "0AS"
                            },
                            {
                                "book": "0",
                                "page": "0",
                                "register": "0c",
                                "mask": "ff",
                                "data": "44",
                                "delay": "",
                                "$$hashKey": "0AT"
                            },
                            {
                                "book": "0",
                                "page": "0",
                                "register": "0b",
                                "mask": "ff",
                                "data": "46",
                                "delay": "",
                                "$$hashKey": "0AU"
                            },
                            {
                                "book": "0",
                                "page": "0",
                                "register": "0D",
                                "mask": "ff",
                                "data": "04",
                                "delay": "",
                                "comments": "",
                                "$$hashKey": "0AV"
                            },
                            {
                                "book": "0",
                                "page": "0",
                                "register": "30",
                                "mask": "ff",
                                "data": "99",
                                "delay": "",
                                "$$hashKey": "0AW"
                            },
                            {
                                "book": "0",
                                "page": "0",
                                "register": "0a",
                                "mask": "ff",
                                "data": "f1",
                                "delay": "",
                                "$$hashKey": "0AX"
                            },
                            {
                                "book": "0",
                                "page": "0",
                                "register": "07",
                                "mask": "ff",
                                "data": "2",
                                "delay": "",
                                "$$hashKey": "0AY"
                            },
                            {
                                "book": "0",
                                "page": "0",
                                "register": "02",
                                "mask": "ff",
                                "data": "0",
                                "delay": "",
                                "$$hashKey": "0AZ"
                            }
                        ],
                        "blockType": "PRE_POWER_UP",
                        "deviceName": "Dev 1 - TAS2562",
                        "deviceValue": 1,
                        "deviceShortName": ""
                    }
                ],
                "configName": "02-calibration-16kHz-16bit-4slot",
                "blockTypeValues": {
                    "COEFF": "0x01",
                    "POST_POWER_UP": "0x02",
                    "PRE_SHUTDOWN": "0x03",
                    "PRE_POWER_UP": "0x04",
                    "POST_SHUTDOWN": "0x05"
                },
                "subBlockTypeValues": {
                    "SINGLE_BYTE_WRITES": "0x01",
                    "BURST_WRITES": "0x02",
                    "DELAY": "0x03",
                    "FIELD_WRITES": "0x04"
                },
                "$$hashKey": "074"
            },
            {
                "blocksList": [
                    {
                        "blockName": "PRE_SHUTDOWN - Dev 1",
                        "commands": [
                            {
                                "book": "0",
                                "page": "0",
                                "register": "02",
                                "mask": "ff",
                                "data": "e",
                                "delay": "",
                                "$$hashKey": "087"
                            }
                        ],
                        "blockType": "PRE_SHUTDOWN",
                        "deviceName": "Dev 1 - TAS2562",
                        "deviceValue": 1,
                        "deviceShortName": ""
                    },
                    {
                        "blockName": "PRE_POWER_UP - Dev 1",
                        "commands": [
                            {
                                "book": "0",
                                "page": "01",
                                "register": "02",
                                "mask": "1e",
                                "data": "2",
                                "delay": "",
                                "$$hashKey": "0CW"
                            },
                            {
                                "book": "0",
                                "page": "0",
                                "register": "42",
                                "mask": "ff",
                                "data": "f8",
                                "delay": "",
                                "comments": "",
                                "$$hashKey": "0CX"
                            },
                            {
                                "book": "0",
                                "page": "0",
                                "register": "06",
                                "mask": "ff",
                                "data": "13",
                                "delay": "",
                                "$$hashKey": "0CY"
                            },
                            {
                                "book": "0",
                                "page": "0",
                                "register": "08",
                                "mask": "ff",
                                "data": "0",
                                "delay": "",
                                "$$hashKey": "0CZ"
                            },
                            {
                                "book": "0",
                                "page": "0",
                                "register": "0c",
                                "mask": "ff",
                                "data": "0",
                                "delay": "",
                                "$$hashKey": "0D0"
                            },
                            {
                                "book": "0",
                                "page": "0",
                                "register": "0b",
                                "mask": "ff",
                                "data": "2",
                                "delay": "",
                                "$$hashKey": "0D1"
                            },
                            {
                                "book": "0",
                                "page": "0",
                                "register": "0d",
                                "mask": "ff",
                                "data": "04",
                                "delay": "",
                                "comments": "",
                                "$$hashKey": "0D2"
                            },
                            {
                                "book": "0",
                                "page": "0",
                                "register": "30",
                                "mask": "ff",
                                "data": "99",
                                "delay": "",
                                "$$hashKey": "0D3"
                            },
                            {
                                "book": "0",
                                "page": "0",
                                "register": "0a",
                                "mask": "ff",
                                "data": "f1",
                                "delay": "",
                                "$$hashKey": "0D4"
                            },
                            {
                                "book": "0",
                                "page": "0",
                                "register": "07",
                                "mask": "ff",
                                "data": "2",
                                "delay": "",
                                "$$hashKey": "0D5"
                            },
                            {
                                "book": "0",
                                "page": "0",
                                "register": "02",
                                "mask": "ff",
                                "data": "0",
                                "delay": "",
                                "$$hashKey": "0D6"
                            }
                        ],
                        "blockType": "PRE_POWER_UP",
                        "deviceName": "Dev 1 - TAS2562",
                        "deviceValue": 1,
                        "deviceShortName": ""
                    }
                ],
                "configName": "03-spk bypass -16k-4slot- electrical test",
                "blockTypeValues": {
                    "COEFF": "0x01",
                    "POST_POWER_UP": "0x02",
                    "PRE_SHUTDOWN": "0x03",
                    "PRE_POWER_UP": "0x04",
                    "POST_SHUTDOWN": "0x05"
                },
                "subBlockTypeValues": {
                    "SINGLE_BYTE_WRITES": "0x01",
                    "BURST_WRITES": "0x02",
                    "DELAY": "0x03",
                    "FIELD_WRITES": "0x04"
                },
                "$$hashKey": "011"
            },
            {
                "blocksList": [
                    {
                        "blockName": "PRE_SHUTDOWN - Dev 1",
                        "commands": [
                            {
                                "book": "0",
                                "page": "0",
                                "register": "02",
                                "mask": "ff",
                                "data": "e",
                                "delay": "",
                                "$$hashKey": "08L"
                            }
                        ],
                        "blockType": "PRE_SHUTDOWN",
                        "deviceName": "Dev 1 - TAS2562",
                        "deviceValue": 1,
                        "deviceShortName": ""
                    },
                    {
                        "blockName": "PRE_POWER_UP - Dev 1",
                        "commands": [
                            {
                                "book": "0",
                                "page": "01",
                                "register": "02",
                                "mask": "1e",
                                "data": "2",
                                "delay": "",
                                "$$hashKey": "0LP"
                            },
                            {
                                "book": "0",
                                "page": "0",
                                "register": "42",
                                "mask": "ff",
                                "data": "f8",
                                "delay": "",
                                "comments": "",
                                "$$hashKey": "0LQ"
                            },
                            {
                                "book": "0",
                                "page": "0",
                                "register": "06",
                                "mask": "ff",
                                "data": "09",
                                "delay": "",
                                "comments": "",
                                "$$hashKey": "0LR"
                            },
                            {
                                "book": "0",
                                "page": "0",
                                "register": "08",
                                "mask": "ff",
                                "data": "30",
                                "delay": "",
                                "$$hashKey": "0LS"
                            },
                            {
                                "book": "0",
                                "page": "0",
                                "register": "0c",
                                "mask": "ff",
                                "data": "0",
                                "delay": "",
                                "$$hashKey": "0LT"
                            },
                            {
                                "book": "0",
                                "page": "0",
                                "register": "0b",
                                "mask": "ff",
                                "data": "2",
                                "delay": "",
                                "$$hashKey": "0LU"
                            },
                            {
                                "book": "0",
                                "page": "0",
                                "register": "0d",
                                "mask": "ff",
                                "data": "04",
                                "delay": "",
                                "comments": "",
                                "$$hashKey": "0LV"
                            },
                            {
                                "book": "0",
                                "page": "0",
                                "register": "30",
                                "mask": "ff",
                                "data": "99",
                                "delay": "",
                                "$$hashKey": "0LW"
                            },
                            {
                                "book": "0",
                                "page": "0",
                                "register": "0a",
                                "mask": "ff",
                                "data": "f1",
                                "delay": "",
                                "$$hashKey": "0LX"
                            },
                            {
                                "book": "0",
                                "page": "0",
                                "register": "07",
                                "mask": "ff",
                                "data": "2",
                                "delay": "",
                                "$$hashKey": "0LY"
                            },
                            {
                                "book": "0",
                                "page": "0",
                                "register": "02",
                                "mask": "ff",
                                "data": "0",
                                "delay": "",
                                "$$hashKey": "0LZ"
                            }
                        ],
                        "blockType": "PRE_POWER_UP",
                        "deviceName": "Dev 1 - TAS2562",
                        "deviceValue": 1,
                        "deviceShortName": ""
                    }
                ],
                "configName": "04-bypass-auto-rate-16bit-L+R",
                "blockTypeValues": {
                    "COEFF": "0x01",
                    "POST_POWER_UP": "0x02",
                    "PRE_SHUTDOWN": "0x03",
                    "PRE_POWER_UP": "0x04",
                    "POST_SHUTDOWN": "0x05"
                },
                "subBlockTypeValues": {
                    "SINGLE_BYTE_WRITES": "0x01",
                    "BURST_WRITES": "0x02",
                    "DELAY": "0x03",
                    "FIELD_WRITES": "0x04"
                },
                "$$hashKey": "012"
            },
            {
                "blocksList": [
                    {
                        "blockName": "PRE_SHUTDOWN - Dev 1",
                        "commands": [
                            {
                                "book": "0",
                                "page": "0",
                                "register": "02",
                                "mask": "ff",
                                "data": "e",
                                "delay": "",
                                "$$hashKey": "08Z"
                            }
                        ],
                        "blockType": "PRE_SHUTDOWN",
                        "deviceName": "Dev 1 - TAS2562",
                        "deviceValue": 0,
                        "deviceShortName": ""
                    },
                    {
                        "blockName": "PRE_POWER_UP - Dev 1",
                        "commands": [
                            {
                                "book": "0",
                                "page": "01",
                                "register": "02",
                                "mask": "1e",
                                "data": "0",
                                "delay": "",
                                "$$hashKey": "0HY"
                            },
                            {
                                "book": "0",
                                "page": "0",
                                "register": "06",
                                "mask": "ff",
                                "data": "09",
                                "delay": "",
                                "$$hashKey": "0HZ"
                            },
                            {
                                "book": "0",
                                "page": "0",
                                "register": "08",
                                "mask": "ff",
                                "data": "70",
                                "delay": "",
                                "$$hashKey": "0I0"
                            },
                            {
                                "book": "0",
                                "page": "0",
                                "register": "0c",
                                "mask": "ff",
                                "data": "42",
                                "delay": "",
                                "$$hashKey": "0I1"
                            },
                            {
                                "book": "0",
                                "page": "0",
                                "register": "0b",
                                "mask": "ff",
                                "data": "40",
                                "delay": "",
                                "$$hashKey": "0I2"
                            },
                            {
                                "book": "0",
                                "page": "0",
                                "register": "0D",
                                "mask": "ff",
                                "data": "4",
                                "delay": "",
                                "comments": "",
                                "$$hashKey": "0I3"
                            },
                            {
                                "book": "0",
                                "page": "0",
                                "register": "30",
                                "mask": "ff",
                                "data": "99",
                                "delay": "",
                                "$$hashKey": "0I4"
                            },
                            {
                                "book": "0",
                                "page": "0",
                                "register": "0a",
                                "mask": "ff",
                                "data": "13",
                                "delay": "",
                                "$$hashKey": "0I5"
                            },
                            {
                                "book": "0",
                                "page": "0",
                                "register": "41",
                                "mask": "ff",
                                "data": "41",
                                "delay": "",
                                "$$hashKey": "0I6"
                            },
                            {
                                "book": "0",
                                "page": "0",
                                "register": "42",
                                "mask": "ff",
                                "data": "f8",
                                "delay": "",
                                "comments": "",
                                "$$hashKey": "0I7"
                            },
                            {
                                "book": "0",
                                "page": "0",
                                "register": "07",
                                "mask": "ff",
                                "data": "2",
                                "delay": "",
                                "$$hashKey": "0I8"
                            },
                            {
                                "book": "0",
                                "page": "0",
                                "register": "02",
                                "mask": "ff",
                                "data": "0",
                                "delay": "",
                                "$$hashKey": "0I9"
                            }
                        ],
                        "blockType": "PRE_POWER_UP",
                        "deviceName": "Dev 1 - TAS2562",
                        "deviceValue": 1,
                        "deviceShortName": ""
                    }
                ],
                "configName": "05-Music-16bit-auto-rate-i2s",
                "blockTypeValues": {
                    "COEFF": "0x01",
                    "POST_POWER_UP": "0x02",
                    "PRE_SHUTDOWN": "0x03",
                    "PRE_POWER_UP": "0x04",
                    "POST_SHUTDOWN": "0x05"
                },
                "subBlockTypeValues": {
                    "SINGLE_BYTE_WRITES": "0x01",
                    "BURST_WRITES": "0x02",
                    "DELAY": "0x03",
                    "FIELD_WRITES": "0x04"
                },
                "$$hashKey": "013"
            },
            {
                "blocksList": [
                    {
                        "blockName": "PRE_SHUTDOWN - Dev 1",
                        "commands": [
                            {
                                "book": "0",
                                "page": "0",
                                "register": "02",
                                "mask": "ff",
                                "data": "e",
                                "delay": "",
                                "$$hashKey": "09D"
                            }
                        ],
                        "blockType": "PRE_SHUTDOWN",
                        "deviceName": "Dev 1 - TAS2562",
                        "deviceValue": 1,
                        "deviceShortName": ""
                    },
                    {
                        "blockName": "PRE_POWER_UP - Dev 1",
                        "commands": [
                            {
                                "book": "0",
                                "page": "01",
                                "register": "02",
                                "mask": "1e",
                                "data": "2",
                                "delay": ""
                            },
                            {
                                "book": "0",
                                "page": "0",
                                "register": "42",
                                "mask": "ff",
                                "data": "f8",
                                "delay": "",
                                "comments": ""
                            },
                            {
                                "book": "0",
                                "page": "0",
                                "register": "06",
                                "mask": "ff",
                                "data": "09",
                                "delay": "",
                                "comments": ""
                            },
                            {
                                "book": "0",
                                "page": "0",
                                "register": "08",
                                "mask": "ff",
                                "data": "10",
                                "delay": ""
                            },
                            {
                                "book": "0",
                                "page": "0",
                                "register": "0c",
                                "mask": "ff",
                                "data": "0",
                                "delay": ""
                            },
                            {
                                "book": "0",
                                "page": "0",
                                "register": "0b",
                                "mask": "ff",
                                "data": "2",
                                "delay": ""
                            },
                            {
                                "book": "0",
                                "page": "0",
                                "register": "0d",
                                "mask": "ff",
                                "data": "04",
                                "delay": "",
                                "comments": ""
                            },
                            {
                                "book": "0",
                                "page": "0",
                                "register": "30",
                                "mask": "ff",
                                "data": "99",
                                "delay": ""
                            },
                            {
                                "book": "0",
                                "page": "0",
                                "register": "0a",
                                "mask": "ff",
                                "data": "f1",
                                "delay": ""
                            },
                            {
                                "book": "0",
                                "page": "0",
                                "register": "07",
                                "mask": "ff",
                                "data": "2",
                                "delay": ""
                            },
                            {
                                "book": "0",
                                "page": "0",
                                "register": "02",
                                "mask": "ff",
                                "data": "0",
                                "delay": ""
                            }
                        ],
                        "blockType": "PRE_POWER_UP",
                        "deviceName": "Dev 1 - TAS2562",
                        "deviceValue": 1,
                        "deviceShortName": ""
                    }
                ],
                "configName": "06-bypass-auto-rate-16bit-L",
                "blockTypeValues": {
                    "COEFF": "0x01",
                    "POST_POWER_UP": "0x02",
                    "PRE_SHUTDOWN": "0x03",
                    "PRE_POWER_UP": "0x04",
                    "POST_SHUTDOWN": "0x05"
                },
                "subBlockTypeValues": {
                    "SINGLE_BYTE_WRITES": "0x01",
                    "BURST_WRITES": "0x02",
                    "DELAY": "0x03",
                    "FIELD_WRITES": "0x04"
                },
                "$$hashKey": "015"
            },
            {
                "blocksList": [
                    {
                        "blockName": "PRE_SHUTDOWN - Dev 1",
                        "commands": [
                            {
                                "book": "0",
                                "page": "0",
                                "register": "02",
                                "mask": "ff",
                                "data": "e",
                                "delay": "",
                                "$$hashKey": "03Z"
                            }
                        ],
                        "blockType": "PRE_SHUTDOWN",
                        "deviceName": "Dev 1 - TAS2562",
                        "deviceValue": 1,
                        "deviceShortName": ""
                    },
                    {
                        "blockName": "PRE_POWER_UP - Dev 1",
                        "commands": [
                            {
                                "book": "0",
                                "page": "01",
                                "register": "02",
                                "mask": "1e",
                                "data": "2",
                                "delay": ""
                            },
                            {
                                "book": "0",
                                "page": "0",
                                "register": "42",
                                "mask": "ff",
                                "data": "f8",
                                "delay": "",
                                "comments": ""
                            },
                            {
                                "book": "0",
                                "page": "0",
                                "register": "06",
                                "mask": "ff",
                                "data": "09",
                                "delay": "",
                                "comments": ""
                            },
                            {
                                "book": "0",
                                "page": "0",
                                "register": "08",
                                "mask": "ff",
                                "data": "20",
                                "delay": ""
                            },
                            {
                                "book": "0",
                                "page": "0",
                                "register": "0c",
                                "mask": "ff",
                                "data": "0",
                                "delay": ""
                            },
                            {
                                "book": "0",
                                "page": "0",
                                "register": "0b",
                                "mask": "ff",
                                "data": "2",
                                "delay": ""
                            },
                            {
                                "book": "0",
                                "page": "0",
                                "register": "0d",
                                "mask": "ff",
                                "data": "04",
                                "delay": "",
                                "comments": ""
                            },
                            {
                                "book": "0",
                                "page": "0",
                                "register": "30",
                                "mask": "ff",
                                "data": "99",
                                "delay": ""
                            },
                            {
                                "book": "0",
                                "page": "0",
                                "register": "0a",
                                "mask": "ff",
                                "data": "f1",
                                "delay": ""
                            },
                            {
                                "book": "0",
                                "page": "0",
                                "register": "07",
                                "mask": "ff",
                                "data": "2",
                                "delay": ""
                            },
                            {
                                "book": "0",
                                "page": "0",
                                "register": "02",
                                "mask": "ff",
                                "data": "0",
                                "delay": ""
                            }
                        ],
                        "blockType": "PRE_POWER_UP",
                        "deviceName": "Dev 1 - TAS2562",
                        "deviceValue": 1,
                        "deviceShortName": ""
                    }
                ],
                "configName": "07-bypass-auto-rate-16bit-R",
                "blockTypeValues": {
                    "COEFF": "0x01",
                    "POST_POWER_UP": "0x02",
                    "PRE_SHUTDOWN": "0x03",
                    "PRE_POWER_UP": "0x04",
                    "POST_SHUTDOWN": "0x05"
                },
                "subBlockTypeValues": {
                    "SINGLE_BYTE_WRITES": "0x01",
                    "BURST_WRITES": "0x02",
                    "DELAY": "0x03",
                    "FIELD_WRITES": "0x04"
                },
                "$$hashKey": "016"
            },
            {
                "blocksList": [
                    {
                        "blockName": "PRE_SHUTDOWN - Dev 1",
                        "commands": [
                            {
                                "book": "0",
                                "page": "0",
                                "register": "02",
                                "mask": "ff",
                                "data": "e",
                                "delay": "",
                                "$$hashKey": "03L"
                            }
                        ],
                        "blockType": "PRE_SHUTDOWN",
                        "deviceName": "Dev 1 - TAS2562",
                        "deviceValue": 0,
                        "deviceShortName": ""
                    },
                    {
                        "blockName": "PRE_POWER_UP - Dev 1",
                        "commands": [
                            {
                                "book": "0",
                                "page": "01",
                                "register": "02",
                                "mask": "1e",
                                "data": "0",
                                "delay": ""
                            },
                            {
                                "book": "0",
                                "page": "0",
                                "register": "06",
                                "mask": "ff",
                                "data": "09",
                                "delay": ""
                            },
                            {
                                "book": "0",
                                "page": "0",
                                "register": "08",
                                "mask": "ff",
                                "data": "7e",
                                "delay": ""
                            },
                            {
                                "book": "0",
                                "page": "0",
                                "register": "0c",
                                "mask": "ff",
                                "data": "40",
                                "delay": "",
                                "comments": "mic1 sit in solt 0 and slot 1"
                            },
                            {
                                "book": "0",
                                "page": "0",
                                "register": "0b",
                                "mask": "ff",
                                "data": "42",
                                "delay": "",
                                "comments": "mic1 sit in solt 2 and slot 3"
                            },
                            {
                                "book": "0",
                                "page": "0",
                                "register": "0d",
                                "mask": "ff",
                                "data": "44",
                                "delay": "",
                                "comments": "echo ref in slot 4/5"
                            },
                            {
                                "book": "0",
                                "page": "0",
                                "register": "30",
                                "mask": "ff",
                                "data": "99",
                                "delay": ""
                            },
                            {
                                "book": "0",
                                "page": "0",
                                "register": "0a",
                                "mask": "ff",
                                "data": "13",
                                "delay": ""
                            },
                            {
                                "book": "0",
                                "page": "0",
                                "register": "41",
                                "mask": "ff",
                                "data": "06",
                                "delay": "",
                                "comments": "set pdm clk as 3.072MHz, enable both pdm mic, PDM mic master"
                            },
                            {
                                "book": "0",
                                "page": "0",
                                "register": "07",
                                "mask": "ff",
                                "data": "2",
                                "delay": ""
                            },
                            {
                                "book": "0",
                                "page": "0",
                                "register": "42",
                                "mask": "ff",
                                "data": "18",
                                "delay": "",
                                "comments": "enable pull down"
                            },
                            {
                                "book": "0",
                                "page": "0",
                                "register": "02",
                                "mask": "ff",
                                "data": "0",
                                "delay": ""
                            }
                        ],
                        "blockType": "PRE_POWER_UP",
                        "deviceName": "Dev 1 - TAS2562",
                        "deviceValue": 1,
                        "deviceShortName": ""
                    }
                ],
                "configName": "08-pdm-rec-i2s-48kHz-32bit-tx-slot-0-1-mic-slot-3-ref",
                "blockTypeValues": {
                    "COEFF": "0x01",
                    "POST_POWER_UP": "0x02",
                    "PRE_SHUTDOWN": "0x03",
                    "PRE_POWER_UP": "0x04",
                    "POST_SHUTDOWN": "0x05"
                },
                "subBlockTypeValues": {
                    "SINGLE_BYTE_WRITES": "0x01",
                    "BURST_WRITES": "0x02",
                    "DELAY": "0x03",
                    "FIELD_WRITES": "0x04"
                },
                "$$hashKey": "014"
            },
            {
                "blocksList": [
                    {
                        "blockName": "PRE_SHUTDOWN - Dev 1",
                        "commands": [
                            {
                                "book": "0",
                                "page": "0",
                                "register": "02",
                                "mask": "ff",
                                "data": "e",
                                "delay": "",
                                "$$hashKey": "03C"
                            }
                        ],
                        "blockType": "PRE_SHUTDOWN",
                        "deviceName": "Dev 1 - TAS2562",
                        "deviceValue": 0,
                        "deviceShortName": ""
                    },
                    {
                        "blockName": "PRE_POWER_UP - Dev 1",
                        "commands": [
                            {
                                "book": "0",
                                "page": "01",
                                "register": "02",
                                "mask": "1e",
                                "data": "0",
                                "delay": "",
                                "$$hashKey": "0JG"
                            },
                            {
                                "book": "0",
                                "page": "0",
                                "register": "06",
                                "mask": "ff",
                                "data": "09",
                                "delay": "",
                                "comments": "",
                                "$$hashKey": "0JH"
                            },
                            {
                                "book": "0",
                                "page": "0",
                                "register": "03",
                                "mask": "ff",
                                "data": "20",
                                "delay": "",
                                "$$hashKey": "0JI"
                            },
                            {
                                "book": "0",
                                "page": "0",
                                "register": "41",
                                "mask": "ff",
                                "data": "41",
                                "delay": "",
                                "$$hashKey": "0JJ"
                            },
                            {
                                "book": "0",
                                "page": "0",
                                "register": "42",
                                "mask": "ff",
                                "data": "f8",
                                "delay": "",
                                "comments": "",
                                "$$hashKey": "0JK"
                            },
                            {
                                "book": "0",
                                "page": "0",
                                "register": "08",
                                "mask": "ff",
                                "data": "3e",
                                "delay": "",
                                "$$hashKey": "0JL"
                            },
                            {
                                "book": "0",
                                "page": "0",
                                "register": "0c",
                                "mask": "ff",
                                "data": "44",
                                "delay": "",
                                "$$hashKey": "0JM"
                            },
                            {
                                "book": "0",
                                "page": "0",
                                "register": "0b",
                                "mask": "ff",
                                "data": "46",
                                "delay": "",
                                "$$hashKey": "0JN"
                            },
                            {
                                "book": "0",
                                "page": "0",
                                "register": "0D",
                                "mask": "ff",
                                "data": "04",
                                "delay": "",
                                "comments": "",
                                "$$hashKey": "0JO"
                            },
                            {
                                "book": "0",
                                "page": "0",
                                "register": "30",
                                "mask": "ff",
                                "data": "99",
                                "delay": "",
                                "$$hashKey": "0JP"
                            },
                            {
                                "book": "0",
                                "page": "0",
                                "register": "0a",
                                "mask": "ff",
                                "data": "f1",
                                "delay": "",
                                "$$hashKey": "0JQ"
                            },
                            {
                                "book": "0",
                                "page": "0",
                                "register": "07",
                                "mask": "ff",
                                "data": "2",
                                "delay": "",
                                "$$hashKey": "0JR"
                            },
                            {
                                "book": "0",
                                "page": "0",
                                "register": "02",
                                "mask": "ff",
                                "data": "0",
                                "delay": "",
                                "$$hashKey": "0JS"
                            }
                        ],
                        "blockType": "PRE_POWER_UP",
                        "deviceName": "Dev 1 - TAS2562",
                        "deviceValue": 1,
                        "deviceShortName": ""
                    }
                ],
                "configName": "09-auto-rate-32bit",
                "blockTypeValues": {
                    "COEFF": "0x01",
                    "POST_POWER_UP": "0x02",
                    "PRE_SHUTDOWN": "0x03",
                    "PRE_POWER_UP": "0x04",
                    "POST_SHUTDOWN": "0x05"
                },
                "subBlockTypeValues": {
                    "SINGLE_BYTE_WRITES": "0x01",
                    "BURST_WRITES": "0x02",
                    "DELAY": "0x03",
                    "FIELD_WRITES": "0x04"
                },
                "$$hashKey": "017"
            },
            {
                "blocksList": [
                    {
                        "blockName": "PRE_SHUTDOWN - Dev 1",
                        "commands": [
                            {
                                "book": "0",
                                "page": "0",
                                "register": "02",
                                "mask": "ff",
                                "data": "e",
                                "delay": "",
                                "$$hashKey": "0KW"
                            }
                        ],
                        "blockType": "PRE_SHUTDOWN",
                        "deviceName": "Dev 1 - TAS2562",
                        "deviceValue": 0,
                        "deviceShortName": ""
                    },
                    {
                        "blockName": "PRE_POWER_UP - Dev 1",
                        "commands": [
                            {
                                "book": "0",
                                "page": "01",
                                "register": "02",
                                "mask": "1e",
                                "data": "2",
                                "delay": "",
                                "$$hashKey": "0MS"
                            },
                            {
                                "book": "0",
                                "page": "0",
                                "register": "06",
                                "mask": "ff",
                                "data": "09",
                                "delay": "",
                                "comments": "",
                                "$$hashKey": "0MT"
                            },
                            {
                                "book": "0",
                                "page": "0",
                                "register": "03",
                                "mask": "ff",
                                "data": "20",
                                "delay": "",
                                "$$hashKey": "0MU"
                            },
                            {
                                "book": "0",
                                "page": "0",
                                "register": "41",
                                "mask": "ff",
                                "data": "41",
                                "delay": "",
                                "$$hashKey": "0MV"
                            },
                            {
                                "book": "0",
                                "page": "0",
                                "register": "42",
                                "mask": "ff",
                                "data": "f8",
                                "delay": "",
                                "comments": "",
                                "$$hashKey": "0MW"
                            },
                            {
                                "book": "0",
                                "page": "0",
                                "register": "08",
                                "mask": "ff",
                                "data": "3e",
                                "delay": "",
                                "$$hashKey": "0MX"
                            },
                            {
                                "book": "0",
                                "page": "0",
                                "register": "0c",
                                "mask": "ff",
                                "data": "44",
                                "delay": "",
                                "$$hashKey": "0MY"
                            },
                            {
                                "book": "0",
                                "page": "0",
                                "register": "0b",
                                "mask": "ff",
                                "data": "46",
                                "delay": "",
                                "$$hashKey": "0MZ"
                            },
                            {
                                "book": "0",
                                "page": "0",
                                "register": "0D",
                                "mask": "ff",
                                "data": "04",
                                "delay": "",
                                "comments": "",
                                "$$hashKey": "0N0"
                            },
                            {
                                "book": "0",
                                "page": "0",
                                "register": "30",
                                "mask": "ff",
                                "data": "99",
                                "delay": "",
                                "$$hashKey": "0N1"
                            },
                            {
                                "book": "0",
                                "page": "0",
                                "register": "0a",
                                "mask": "ff",
                                "data": "f1",
                                "delay": "",
                                "$$hashKey": "0N2"
                            },
                            {
                                "book": "0",
                                "page": "0",
                                "register": "07",
                                "mask": "ff",
                                "data": "2",
                                "delay": "",
                                "$$hashKey": "0N3"
                            },
                            {
                                "book": "0",
                                "page": "0",
                                "register": "02",
                                "mask": "ff",
                                "data": "0",
                                "delay": "",
                                "$$hashKey": "0N4"
                            }
                        ],
                        "blockType": "PRE_POWER_UP",
                        "deviceName": "Dev 1 - TAS2562",
                        "deviceValue": 1,
                        "deviceShortName": ""
                    }
                ],
                "configName": "10-bypass-auto-rate-32bit",
                "blockTypeValues": {
                    "COEFF": "0x01",
                    "POST_POWER_UP": "0x02",
                    "PRE_SHUTDOWN": "0x03",
                    "PRE_POWER_UP": "0x04",
                    "POST_SHUTDOWN": "0x05"
                },
                "subBlockTypeValues": {
                    "SINGLE_BYTE_WRITES": "0x01",
                    "BURST_WRITES": "0x02",
                    "DELAY": "0x03",
                    "FIELD_WRITES": "0x04"
                },
                "$$hashKey": "0KJ"
            }
        ],
        "binConfig": {
            "headerSize": 292,
            "binaryVersion": [
                0,
                0,
                1,
                5
            ],
            "driverVersion": [
                0,
                0,
                1,
                1
            ],
            "maxConfigs": 64,
            "maxDevice": 8,
            "configNameLength": 64,
            "types": {
                "deviceType": {
                    "availableDeviceTypes": [
                        "Integrated",
                        "Non Integrated"
                    ]
                },
                "platformType": {
                    "values": {
                        "QCom": "0x01",
                        "MTK": "0x02",
                        "LSI": "0x03"
                    },
                    "valueType": "int",
                    "length": 1
                },
                "deviceCount": {
                    "values": {
                        "1 Device": "0x01",
                        "2 Devices": "0x02",
                        "3 Device": "0x03",
                        "4 Devices": "0x04",
                        "5 Device": "0x05",
                        "6 Devices": "0x06",
                        "7 Devices": "0x07",
                        "8 Devices": "0x08"
                    },
                    "valueType": "int",
                    "length": 1
                },
                "amplifierType": {
                    "values": {
                        "TAS2558": "0x01",
                        "TAS2560": "0x02",
                        "TAS2562": "0x03",
                        "TAS2564": "0x04",
                        "TAS2783": "0x05"
                    },
                    "valueType": "int",
                    "length": 8
                },
                "blockType": {
                    "values": {
                        "COEFF": "0x01",
                        "POST_POWER_UP": "0x02",
                        "PRE_SHUTDOWN": "0x03",
                        "PRE_POWER_UP": "0x04",
                        "POST_SHUTDOWN": "0x05"
                    },
                    "valueType": "int",
                    "length": 1
                },
                "subBlockType": {
                    "values": {
                        "SINGLE_BYTE_WRITES": "0x01",
                        "BURST_WRITES": "0x02",
                        "DELAY": "0x03",
                        "FIELD_WRITES": "0x04"
                    },
                    "valueType": "int",
                    "length": 1
                }
            }
        },
        "platformType": "QCom",
        "devicesCount": "1 Device",
        "amplifierType": [
            "TAS2562"
        ],
        "deviceType": "Non Integrated"
    }
}