\relax 
\@writefile{toc}{\contentsline {section}{\numberline {6.18}File I/\discretionary {\unhbox \voidb@x \hbox {\relax \fontsize  {7}{8}\selectfont  $\leftarrow \joinrel  \rhook $}}{}{}O}{44}{section.6.18}}
\newlabel{group__file__io}{{6.18}{44}{File I/\+O\relax }{section.6.18}{}}
\newlabel{group__file__io_ga5aff27296c7564e2b7374726a172e5ec}{{6.18}{44}{Functions\relax }{section*.25}{}}
\newlabel{group__file__io_gaafd49a5683c87dfc358d56493cf14d62}{{6.18}{44}{Functions\relax }{section*.25}{}}
\@writefile{toc}{\contentsline {subsection}{\numberline {6.18.1}Detailed Description}{44}{subsection.6.18.1}}
\@writefile{toc}{\contentsline {subsection}{\numberline {6.18.2}Function Documentation}{44}{subsection.6.18.2}}
\@writefile{toc}{\contentsline {subsubsection}{\numberline {6.18.2.1}T\discretionary {\unhbox \voidb@x \hbox {\relax \fontsize  {7}{8}\selectfont  $\leftarrow \joinrel  \rhook $}}{}{}I\discretionary {\unhbox \voidb@x \hbox {\relax \fontsize  {7}{8}\selectfont  $\leftarrow \joinrel  \rhook $}}{}{}G\discretionary {\unhbox \voidb@x \hbox {\relax \fontsize  {7}{8}\selectfont  $\leftarrow \joinrel  \rhook $}}{}{}L\discretionary {\unhbox \voidb@x \hbox {\relax \fontsize  {7}{8}\selectfont  $\leftarrow \joinrel  \rhook $}}{}{}Rw\discretionary {\unhbox \voidb@x \hbox {\relax \fontsize  {7}{8}\selectfont  $\leftarrow \joinrel  \rhook $}}{}{}Read\discretionary {\unhbox \voidb@x \hbox {\relax \fontsize  {7}{8}\selectfont  $\leftarrow \joinrel  \rhook $}}{}{}Adj\discretionary {\unhbox \voidb@x \hbox {\relax \fontsize  {7}{8}\selectfont  $\leftarrow \joinrel  \rhook $}}{}{}List}{44}{subsubsection.6.18.2.1}}
\newlabel{group__file__io_ga07b37b5c84ed6aa573ff6ed56bcb0c5c}{{6.18.2.1}{44}{T\+I\+G\+L\+Rw\+Read\+Adj\+List\relax }{subsubsection.6.18.2.1}{}}
\@writefile{toc}{\contentsline {subsubsection}{\numberline {6.18.2.2}T\discretionary {\unhbox \voidb@x \hbox {\relax \fontsize  {7}{8}\selectfont  $\leftarrow \joinrel  \rhook $}}{}{}I\discretionary {\unhbox \voidb@x \hbox {\relax \fontsize  {7}{8}\selectfont  $\leftarrow \joinrel  \rhook $}}{}{}G\discretionary {\unhbox \voidb@x \hbox {\relax \fontsize  {7}{8}\selectfont  $\leftarrow \joinrel  \rhook $}}{}{}L\discretionary {\unhbox \voidb@x \hbox {\relax \fontsize  {7}{8}\selectfont  $\leftarrow \joinrel  \rhook $}}{}{}Rw\discretionary {\unhbox \voidb@x \hbox {\relax \fontsize  {7}{8}\selectfont  $\leftarrow \joinrel  \rhook $}}{}{}Write\discretionary {\unhbox \voidb@x \hbox {\relax \fontsize  {7}{8}\selectfont  $\leftarrow \joinrel  \rhook $}}{}{}Adj\discretionary {\unhbox \voidb@x \hbox {\relax \fontsize  {7}{8}\selectfont  $\leftarrow \joinrel  \rhook $}}{}{}List}{44}{subsubsection.6.18.2.2}}
\newlabel{group__file__io_ga5240081eacfeecd4ec6c90bc2e2084ff}{{6.18.2.2}{44}{T\+I\+G\+L\+Rw\+Write\+Adj\+List\relax }{subsubsection.6.18.2.2}{}}
\@writefile{toc}{\contentsline {subsubsection}{\numberline {6.18.2.3}Write\discretionary {\unhbox \voidb@x \hbox {\relax \fontsize  {7}{8}\selectfont  $\leftarrow \joinrel  \rhook $}}{}{}Adj\discretionary {\unhbox \voidb@x \hbox {\relax \fontsize  {7}{8}\selectfont  $\leftarrow \joinrel  \rhook $}}{}{}List\discretionary {\unhbox \voidb@x \hbox {\relax \fontsize  {7}{8}\selectfont  $\leftarrow \joinrel  \rhook $}}{}{}Weighted}{44}{subsubsection.6.18.2.3}}
\newlabel{group__file__io_ga20702e531f08fcf6683851e4b428ddf4}{{6.18.2.3}{44}{Write\+Adj\+List\+Weighted\relax }{subsubsection.6.18.2.3}{}}
\@setckpt{group__file__io}{
\setcounter{page}{45}
\setcounter{equation}{0}
\setcounter{enumi}{5}
\setcounter{enumii}{0}
\setcounter{enumiii}{0}
\setcounter{enumiv}{0}
\setcounter{footnote}{0}
\setcounter{mpfootnote}{0}
\setcounter{part}{0}
\setcounter{chapter}{6}
\setcounter{section}{18}
\setcounter{subsection}{2}
\setcounter{subsubsection}{3}
\setcounter{paragraph}{0}
\setcounter{subparagraph}{0}
\setcounter{figure}{0}
\setcounter{table}{0}
\setcounter{float@type}{4}
\setcounter{PWSTtable}{22}
\setcounter{NAT@ctr}{0}
\setcounter{lofdepth}{1}
\setcounter{lotdepth}{1}
\setcounter{Item}{47}
\setcounter{Hfootnote}{0}
\setcounter{section@level}{3}
}
