\relax 
\@writefile{toc}{\contentsline {section}{\numberline {6.9}Graph Generation}{35}{section.6.9}}
\newlabel{group__gen__test}{{6.9}{35}{Graph Generation\relax }{section.6.9}{}}
\@writefile{toc}{\contentsline {subsection}{\numberline {6.9.1}Detailed Description}{35}{subsection.6.9.1}}
\@writefile{toc}{\contentsline {subsection}{\numberline {6.9.2}Function Documentation}{35}{subsection.6.9.2}}
\@writefile{toc}{\contentsline {subsubsection}{\numberline {6.9.2.1}main}{35}{subsubsection.6.9.2.1}}
\newlabel{group__gen__test_ga0ddf1224851353fc92bfbff6f499fa97}{{6.9.2.1}{35}{main\relax }{subsubsection.6.9.2.1}{}}
\@setckpt{group__gen__test}{
\setcounter{page}{36}
\setcounter{equation}{0}
\setcounter{enumi}{5}
\setcounter{enumii}{0}
\setcounter{enumiii}{0}
\setcounter{enumiv}{0}
\setcounter{footnote}{0}
\setcounter{mpfootnote}{0}
\setcounter{part}{0}
\setcounter{chapter}{6}
\setcounter{section}{9}
\setcounter{subsection}{2}
\setcounter{subsubsection}{1}
\setcounter{paragraph}{0}
\setcounter{subparagraph}{0}
\setcounter{figure}{0}
\setcounter{table}{0}
\setcounter{float@type}{4}
\setcounter{PWSTtable}{22}
\setcounter{NAT@ctr}{0}
\setcounter{lofdepth}{1}
\setcounter{lotdepth}{1}
\setcounter{Item}{39}
\setcounter{Hfootnote}{0}
\setcounter{section@level}{3}
}
