\relax 
\@writefile{toc}{\contentsline {section}{\numberline {6.16}Mutation Engine}{42}{section.6.16}}
\newlabel{group__mutation__engine}{{6.16}{42}{Mutation Engine\relax }{section.6.16}{}}
\@writefile{toc}{\contentsline {subsection}{\numberline {6.16.1}Detailed Description}{42}{subsection.6.16.1}}
\@setckpt{group__mutation__engine}{
\setcounter{page}{43}
\setcounter{equation}{0}
\setcounter{enumi}{5}
\setcounter{enumii}{0}
\setcounter{enumiii}{0}
\setcounter{enumiv}{0}
\setcounter{footnote}{0}
\setcounter{mpfootnote}{0}
\setcounter{part}{0}
\setcounter{chapter}{6}
\setcounter{section}{16}
\setcounter{subsection}{1}
\setcounter{subsubsection}{0}
\setcounter{paragraph}{0}
\setcounter{subparagraph}{0}
\setcounter{figure}{0}
\setcounter{table}{0}
\setcounter{float@type}{4}
\setcounter{PWSTtable}{22}
\setcounter{NAT@ctr}{0}
\setcounter{lofdepth}{1}
\setcounter{lotdepth}{1}
\setcounter{Item}{47}
\setcounter{Hfootnote}{0}
\setcounter{section@level}{2}
}
