This is BibTeX, Version 0.99c (TeX Live 2009/Debian)
The top-level auxiliary file: refman.aux
A level-1 auxiliary file: group__pageRank.aux
A level-1 auxiliary file: group__SSSP.aux
A level-1 auxiliary file: group__comm__routines.aux
A level-1 auxiliary file: group__comm__engine.aux
A level-1 auxiliary file: group__messages.aux
A level-1 auxiliary file: group__containers.aux
A level-1 auxiliary file: group__core.aux
A level-1 auxiliary file: group__gen__test.aux
A level-1 auxiliary file: group__mutation__test__1D.aux
A level-1 auxiliary file: group__mutation__test__mpi.aux
A level-1 auxiliary file: group__interface__engine.aux
A level-1 auxiliary file: group__data__structures.aux
A level-1 auxiliary file: group__comp__engine.aux
A level-1 auxiliary file: group__comm__module.aux
A level-1 auxiliary file: group__mutation__engine.aux
A level-1 auxiliary file: group__appGroup.aux
A level-1 auxiliary file: group__file__io.aux
A level-1 auxiliary file: group__misc__tools.aux
A level-1 auxiliary file: group__graph__gen.aux
A level-1 auxiliary file: group__tests.aux
The style file: plain.bst
Database file #1: tigl.bib
You've used 3 entries,
            2118 wiz_defined-function locations,
            543 strings with 5009 characters,
and the built_in function-call counts, 1446 in all, are:
= -- 141
> -- 68
< -- 2
+ -- 29
- -- 24
* -- 105
:= -- 223
add.period$ -- 9
call.type$ -- 3
change.case$ -- 21
chr.to.int$ -- 0
cite$ -- 3
duplicate$ -- 57
empty$ -- 110
format.name$ -- 24
if$ -- 310
int.to.chr$ -- 0
int.to.str$ -- 3
missing$ -- 3
newline$ -- 18
num.names$ -- 6
pop$ -- 23
preamble$ -- 1
purify$ -- 18
quote$ -- 0
skip$ -- 48
stack$ -- 0
substring$ -- 106
swap$ -- 23
text.length$ -- 2
text.prefix$ -- 0
top$ -- 0
type$ -- 12
warning$ -- 0
while$ -- 14
width$ -- 4
write$ -- 36
