\relax 
\@writefile{toc}{\contentsline {section}{\numberline {6.5}Communication Engine}{31}{section.6.5}}
\newlabel{group__comm__engine}{{6.5}{31}{Communication Engine\relax }{section.6.5}{}}
\@writefile{toc}{\contentsline {subsection}{\numberline {6.5.1}Detailed Description}{31}{subsection.6.5.1}}
\@setckpt{group__comm__engine}{
\setcounter{page}{32}
\setcounter{equation}{0}
\setcounter{enumi}{8}
\setcounter{enumii}{0}
\setcounter{enumiii}{0}
\setcounter{enumiv}{0}
\setcounter{footnote}{0}
\setcounter{mpfootnote}{0}
\setcounter{part}{0}
\setcounter{chapter}{6}
\setcounter{section}{5}
\setcounter{subsection}{1}
\setcounter{subsubsection}{0}
\setcounter{paragraph}{0}
\setcounter{subparagraph}{0}
\setcounter{figure}{0}
\setcounter{table}{0}
\setcounter{float@type}{4}
\setcounter{PWSTtable}{22}
\setcounter{NAT@ctr}{0}
\setcounter{lofdepth}{1}
\setcounter{lotdepth}{1}
\setcounter{Item}{34}
\setcounter{Hfootnote}{0}
\setcounter{section@level}{2}
}
