\relax 
\gdef \PWST@xxvii{1}
\@writefile{toc}{\contentsline {section}{\numberline {6.20}Graph Generation}{48}{section.6.20}}
\newlabel{group__graph__gen}{{6.20}{48}{Graph Generation\relax }{section.6.20}{}}
\@writefile{toc}{\contentsline {subsection}{\numberline {6.20.1}Detailed Description}{48}{subsection.6.20.1}}
\@writefile{toc}{\contentsline {subsection}{\numberline {6.20.2}Function Documentation}{48}{subsection.6.20.2}}
\@writefile{toc}{\contentsline {subsubsection}{\numberline {6.20.2.1}tigl\discretionary {\unhbox \voidb@x \hbox {\relax \fontsize  {7}{8}\selectfont  $\leftarrow \joinrel  \rhook $}}{}{}Generation\discretionary {\unhbox \voidb@x \hbox {\relax \fontsize  {7}{8}\selectfont  $\leftarrow \joinrel  \rhook $}}{}{}Construct\discretionary {\unhbox \voidb@x \hbox {\relax \fontsize  {7}{8}\selectfont  $\leftarrow \joinrel  \rhook $}}{}{}Graph\discretionary {\unhbox \voidb@x \hbox {\relax \fontsize  {7}{8}\selectfont  $\leftarrow \joinrel  \rhook $}}{}{}Rmat}{48}{subsubsection.6.20.2.1}}
\newlabel{group__graph__gen_ga154582cde79938a8ab8fa4423842c1cd}{{6.20.2.1}{48}{tigl\+Generation\+Construct\+Graph\+Rmat\relax }{subsubsection.6.20.2.1}{}}
\gdef \PWST@xxviii{1}
\gdef \PWST@xxix{1}
\@writefile{toc}{\contentsline {subsubsection}{\numberline {6.20.2.2}tigl\discretionary {\unhbox \voidb@x \hbox {\relax \fontsize  {7}{8}\selectfont  $\leftarrow \joinrel  \rhook $}}{}{}Generation\discretionary {\unhbox \voidb@x \hbox {\relax \fontsize  {7}{8}\selectfont  $\leftarrow \joinrel  \rhook $}}{}{}Construct\discretionary {\unhbox \voidb@x \hbox {\relax \fontsize  {7}{8}\selectfont  $\leftarrow \joinrel  \rhook $}}{}{}Graph\discretionary {\unhbox \voidb@x \hbox {\relax \fontsize  {7}{8}\selectfont  $\leftarrow \joinrel  \rhook $}}{}{}Rmat}{49}{subsubsection.6.20.2.2}}
\newlabel{group__graph__gen_gae3194a7e094fc2e1084b86d829927e55}{{6.20.2.2}{49}{tigl\+Generation\+Construct\+Graph\+Rmat\relax }{subsubsection.6.20.2.2}{}}
\@writefile{toc}{\contentsline {subsubsection}{\numberline {6.20.2.3}tigl\discretionary {\unhbox \voidb@x \hbox {\relax \fontsize  {7}{8}\selectfont  $\leftarrow \joinrel  \rhook $}}{}{}Generation\discretionary {\unhbox \voidb@x \hbox {\relax \fontsize  {7}{8}\selectfont  $\leftarrow \joinrel  \rhook $}}{}{}Generate\discretionary {\unhbox \voidb@x \hbox {\relax \fontsize  {7}{8}\selectfont  $\leftarrow \joinrel  \rhook $}}{}{}Edge\discretionary {\unhbox \voidb@x \hbox {\relax \fontsize  {7}{8}\selectfont  $\leftarrow \joinrel  \rhook $}}{}{}List}{49}{subsubsection.6.20.2.3}}
\newlabel{group__graph__gen_ga3c3207201da97886569a8f1bb4d7d99f}{{6.20.2.3}{49}{tigl\+Generation\+Generate\+Edge\+List\relax }{subsubsection.6.20.2.3}{}}
\@writefile{toc}{\contentsline {subsubsection}{\numberline {6.20.2.4}tigl\discretionary {\unhbox \voidb@x \hbox {\relax \fontsize  {7}{8}\selectfont  $\leftarrow \joinrel  \rhook $}}{}{}Generation\discretionary {\unhbox \voidb@x \hbox {\relax \fontsize  {7}{8}\selectfont  $\leftarrow \joinrel  \rhook $}}{}{}Partition\discretionary {\unhbox \voidb@x \hbox {\relax \fontsize  {7}{8}\selectfont  $\leftarrow \joinrel  \rhook $}}{}{}Graph}{49}{subsubsection.6.20.2.4}}
\newlabel{group__graph__gen_gaaf06b5f7ff4e33691bce745642e43c65}{{6.20.2.4}{49}{tigl\+Generation\+Partition\+Graph\relax }{subsubsection.6.20.2.4}{}}
\@writefile{toc}{\contentsline {subsubsection}{\numberline {6.20.2.5}tigl\discretionary {\unhbox \voidb@x \hbox {\relax \fontsize  {7}{8}\selectfont  $\leftarrow \joinrel  \rhook $}}{}{}Generation\discretionary {\unhbox \voidb@x \hbox {\relax \fontsize  {7}{8}\selectfont  $\leftarrow \joinrel  \rhook $}}{}{}Remove\discretionary {\unhbox \voidb@x \hbox {\relax \fontsize  {7}{8}\selectfont  $\leftarrow \joinrel  \rhook $}}{}{}Self\discretionary {\unhbox \voidb@x \hbox {\relax \fontsize  {7}{8}\selectfont  $\leftarrow \joinrel  \rhook $}}{}{}Cycles}{49}{subsubsection.6.20.2.5}}
\newlabel{group__graph__gen_ga93964f0463f89fd2490b88fc4515b8ef}{{6.20.2.5}{49}{tigl\+Generation\+Remove\+Self\+Cycles\relax }{subsubsection.6.20.2.5}{}}
\@setckpt{group__graph__gen}{
\setcounter{page}{50}
\setcounter{equation}{0}
\setcounter{enumi}{2}
\setcounter{enumii}{0}
\setcounter{enumiii}{0}
\setcounter{enumiv}{0}
\setcounter{footnote}{0}
\setcounter{mpfootnote}{0}
\setcounter{part}{0}
\setcounter{chapter}{6}
\setcounter{section}{20}
\setcounter{subsection}{2}
\setcounter{subsubsection}{5}
\setcounter{paragraph}{0}
\setcounter{subparagraph}{0}
\setcounter{figure}{0}
\setcounter{table}{0}
\setcounter{float@type}{4}
\setcounter{PWSTtable}{29}
\setcounter{NAT@ctr}{0}
\setcounter{lofdepth}{1}
\setcounter{lotdepth}{1}
\setcounter{Item}{55}
\setcounter{Hfootnote}{0}
\setcounter{section@level}{3}
}
