\relax 
\@writefile{toc}{\contentsline {section}{\numberline {6.11}Mutation Manager with M\discretionary {\unhbox \voidb@x \hbox {\relax \fontsize  {7}{8}\selectfont  $\leftarrow \joinrel  \rhook $}}{}{}P\discretionary {\unhbox \voidb@x \hbox {\relax \fontsize  {7}{8}\selectfont  $\leftarrow \joinrel  \rhook $}}{}{}I}{37}{section.6.11}}
\newlabel{group__mutation__test__mpi}{{6.11}{37}{Mutation Manager with M\+P\+I\relax }{section.6.11}{}}
\@writefile{toc}{\contentsline {subsection}{\numberline {6.11.1}Detailed Description}{37}{subsection.6.11.1}}
\@writefile{toc}{\contentsline {subsection}{\numberline {6.11.2}Function Documentation}{37}{subsection.6.11.2}}
\@writefile{toc}{\contentsline {subsubsection}{\numberline {6.11.2.1}main}{37}{subsubsection.6.11.2.1}}
\newlabel{group__mutation__test__mpi_ga0ddf1224851353fc92bfbff6f499fa97}{{6.11.2.1}{37}{main\relax }{subsubsection.6.11.2.1}{}}
\@setckpt{group__mutation__test__mpi}{
\setcounter{page}{38}
\setcounter{equation}{0}
\setcounter{enumi}{5}
\setcounter{enumii}{0}
\setcounter{enumiii}{0}
\setcounter{enumiv}{0}
\setcounter{footnote}{0}
\setcounter{mpfootnote}{0}
\setcounter{part}{0}
\setcounter{chapter}{6}
\setcounter{section}{11}
\setcounter{subsection}{2}
\setcounter{subsubsection}{1}
\setcounter{paragraph}{0}
\setcounter{subparagraph}{0}
\setcounter{figure}{0}
\setcounter{table}{0}
\setcounter{float@type}{4}
\setcounter{PWSTtable}{22}
\setcounter{NAT@ctr}{0}
\setcounter{lofdepth}{1}
\setcounter{lotdepth}{1}
\setcounter{Item}{47}
\setcounter{Hfootnote}{0}
\setcounter{section@level}{3}
}
