\relax 
\@writefile{toc}{\contentsline {section}{\numberline {6.10}Mutation Manager with a single device}{36}{section.6.10}}
\newlabel{group__mutation__test__1D}{{6.10}{36}{Mutation Manager with a single device\relax }{section.6.10}{}}
\@writefile{toc}{\contentsline {subsection}{\numberline {6.10.1}Detailed Description}{36}{subsection.6.10.1}}
\@writefile{toc}{\contentsline {subsection}{\numberline {6.10.2}Function Documentation}{36}{subsection.6.10.2}}
\@writefile{toc}{\contentsline {subsubsection}{\numberline {6.10.2.1}main}{36}{subsubsection.6.10.2.1}}
\newlabel{group__mutation__test__1D_ga0ddf1224851353fc92bfbff6f499fa97}{{6.10.2.1}{36}{main\relax }{subsubsection.6.10.2.1}{}}
\@setckpt{group__mutation__test__1D}{
\setcounter{page}{37}
\setcounter{equation}{0}
\setcounter{enumi}{3}
\setcounter{enumii}{0}
\setcounter{enumiii}{0}
\setcounter{enumiv}{0}
\setcounter{footnote}{0}
\setcounter{mpfootnote}{0}
\setcounter{part}{0}
\setcounter{chapter}{6}
\setcounter{section}{10}
\setcounter{subsection}{2}
\setcounter{subsubsection}{1}
\setcounter{paragraph}{0}
\setcounter{subparagraph}{0}
\setcounter{figure}{0}
\setcounter{table}{0}
\setcounter{float@type}{4}
\setcounter{PWSTtable}{22}
\setcounter{NAT@ctr}{0}
\setcounter{lofdepth}{1}
\setcounter{lotdepth}{1}
\setcounter{Item}{42}
\setcounter{Hfootnote}{0}
\setcounter{section@level}{3}
}
