\relax 
\gdef \PWST@ii{1}
\@writefile{toc}{\contentsline {section}{\numberline {6.2}The Page Rank Algorithm}{21}{section.6.2}}
\newlabel{group__pageRank}{{6.2}{21}{The Page Rank Algorithm\relax }{section.6.2}{}}
\@writefile{toc}{\contentsline {subsection}{\numberline {6.2.1}Detailed Description}{21}{subsection.6.2.1}}
\@writefile{toc}{\contentsline {subsection}{\numberline {6.2.2}Function Documentation}{21}{subsection.6.2.2}}
\@writefile{toc}{\contentsline {subsubsection}{\numberline {6.2.2.1}main}{21}{subsubsection.6.2.2.1}}
\newlabel{group__pageRank_ga0ddf1224851353fc92bfbff6f499fa97}{{6.2.2.1}{21}{main\relax }{subsubsection.6.2.2.1}{}}
\gdef \PWST@iii{1}
\@writefile{toc}{\contentsline {subsubsection}{\numberline {6.2.2.2}Page\discretionary {\unhbox \voidb@x \hbox {\relax \fontsize  {7}{8}\selectfont  $\leftarrow \joinrel  \rhook $}}{}{}Rank}{22}{subsubsection.6.2.2.2}}
\newlabel{group__pageRank_ga7eaaa0b862cc722c2c3cb2383ccce5e4}{{6.2.2.2}{22}{Page\+Rank\relax }{subsubsection.6.2.2.2}{}}
\@setckpt{group__pageRank}{
\setcounter{page}{23}
\setcounter{equation}{0}
\setcounter{enumi}{2}
\setcounter{enumii}{0}
\setcounter{enumiii}{0}
\setcounter{enumiv}{0}
\setcounter{footnote}{0}
\setcounter{mpfootnote}{0}
\setcounter{part}{0}
\setcounter{chapter}{6}
\setcounter{section}{2}
\setcounter{subsection}{2}
\setcounter{subsubsection}{2}
\setcounter{paragraph}{0}
\setcounter{subparagraph}{0}
\setcounter{figure}{0}
\setcounter{table}{0}
\setcounter{float@type}{4}
\setcounter{PWSTtable}{3}
\setcounter{NAT@ctr}{0}
\setcounter{lofdepth}{1}
\setcounter{lotdepth}{1}
\setcounter{Item}{22}
\setcounter{Hfootnote}{0}
\setcounter{section@level}{3}
}
