\relax 
\@writefile{toc}{\contentsline {section}{\numberline {6.6}Messages}{32}{section.6.6}}
\newlabel{group__messages}{{6.6}{32}{Messages\relax }{section.6.6}{}}
\@writefile{toc}{\contentsline {subsection}{\numberline {6.6.1}Detailed Description}{32}{subsection.6.6.1}}
\@setckpt{group__messages}{
\setcounter{page}{33}
\setcounter{equation}{0}
\setcounter{enumi}{8}
\setcounter{enumii}{0}
\setcounter{enumiii}{0}
\setcounter{enumiv}{0}
\setcounter{footnote}{0}
\setcounter{mpfootnote}{0}
\setcounter{part}{0}
\setcounter{chapter}{6}
\setcounter{section}{6}
\setcounter{subsection}{1}
\setcounter{subsubsection}{0}
\setcounter{paragraph}{0}
\setcounter{subparagraph}{0}
\setcounter{figure}{0}
\setcounter{table}{0}
\setcounter{float@type}{4}
\setcounter{PWSTtable}{22}
\setcounter{NAT@ctr}{0}
\setcounter{lofdepth}{1}
\setcounter{lotdepth}{1}
\setcounter{Item}{34}
\setcounter{Hfootnote}{0}
\setcounter{section@level}{2}
}
