\relax 
\@writefile{toc}{\contentsline {section}{\numberline {6.21}Tests}{50}{section.6.21}}
\newlabel{group__tests}{{6.21}{50}{Tests\relax }{section.6.21}{}}
\@writefile{toc}{\contentsline {subsection}{\numberline {6.21.1}Detailed Description}{50}{subsection.6.21.1}}
\@setckpt{group__tests}{
\setcounter{page}{51}
\setcounter{equation}{0}
\setcounter{enumi}{2}
\setcounter{enumii}{0}
\setcounter{enumiii}{0}
\setcounter{enumiv}{0}
\setcounter{footnote}{0}
\setcounter{mpfootnote}{0}
\setcounter{part}{0}
\setcounter{chapter}{6}
\setcounter{section}{21}
\setcounter{subsection}{1}
\setcounter{subsubsection}{0}
\setcounter{paragraph}{0}
\setcounter{subparagraph}{0}
\setcounter{figure}{0}
\setcounter{table}{0}
\setcounter{float@type}{4}
\setcounter{PWSTtable}{29}
\setcounter{NAT@ctr}{0}
\setcounter{lofdepth}{1}
\setcounter{lotdepth}{1}
\setcounter{Item}{55}
\setcounter{Hfootnote}{0}
\setcounter{section@level}{2}
}
