\relax 
\@writefile{toc}{\contentsline {section}{\numberline {6.9}Memory Allocators}{35}{section.6.9}}
\newlabel{group__mem__alloc}{{6.9}{35}{Memory Allocators\relax }{section.6.9}{}}
\@writefile{toc}{\contentsline {subsection}{\numberline {6.9.1}Detailed Description}{35}{subsection.6.9.1}}
\@setckpt{group__mem__alloc}{
\setcounter{page}{36}
\setcounter{equation}{0}
\setcounter{enumi}{8}
\setcounter{enumii}{0}
\setcounter{enumiii}{0}
\setcounter{enumiv}{0}
\setcounter{footnote}{0}
\setcounter{mpfootnote}{0}
\setcounter{part}{0}
\setcounter{chapter}{6}
\setcounter{section}{9}
\setcounter{subsection}{1}
\setcounter{subsubsection}{0}
\setcounter{paragraph}{0}
\setcounter{subparagraph}{0}
\setcounter{figure}{0}
\setcounter{table}{0}
\setcounter{float@type}{4}
\setcounter{PWSTtable}{22}
\setcounter{NAT@ctr}{0}
\setcounter{lofdepth}{1}
\setcounter{lotdepth}{1}
\setcounter{Item}{34}
\setcounter{Hfootnote}{0}
\setcounter{section@level}{2}
}
