\relax 
\@writefile{toc}{\contentsline {section}{\numberline {6.19}Miscellenous}{45}{section.6.19}}
\newlabel{group__misc__tools}{{6.19}{45}{Miscellenous\relax }{section.6.19}{}}
\newlabel{group__misc__tools_ga772a5f1377d8c6b66ab70f511e3dfc52}{{6.19}{45}{Functions\relax }{section*.26}{}}
\newlabel{group__misc__tools_ga2befdfe64cd356073493c2b7f0faf34d}{{6.19}{45}{Functions\relax }{section*.26}{}}
\newlabel{group__misc__tools_ga12da4cca047aa79efda31868674fd69a}{{6.19}{45}{Functions\relax }{section*.26}{}}
\newlabel{group__misc__tools_gaba06990768c6b572ca3f69029334a9df}{{6.19}{45}{Functions\relax }{section*.26}{}}
\@writefile{toc}{\contentsline {subsection}{\numberline {6.19.1}Detailed Description}{45}{subsection.6.19.1}}
\@writefile{toc}{\contentsline {subsection}{\numberline {6.19.2}Function Documentation}{45}{subsection.6.19.2}}
\@writefile{toc}{\contentsline {subsubsection}{\numberline {6.19.2.1}tigl\discretionary {\unhbox \voidb@x \hbox {\relax \fontsize  {7}{8}\selectfont  $\leftarrow \joinrel  \rhook $}}{}{}Utils\discretionary {\unhbox \voidb@x \hbox {\relax \fontsize  {7}{8}\selectfont  $\leftarrow \joinrel  \rhook $}}{}{}Check\discretionary {\unhbox \voidb@x \hbox {\relax \fontsize  {7}{8}\selectfont  $\leftarrow \joinrel  \rhook $}}{}{}Symmetry}{45}{subsubsection.6.19.2.1}}
\newlabel{group__misc__tools_ga02066628879346c4b2f5b73a26af0b76}{{6.19.2.1}{45}{tigl\+Utils\+Check\+Symmetry\relax }{subsubsection.6.19.2.1}{}}
\@writefile{toc}{\contentsline {subsubsection}{\numberline {6.19.2.2}tigl\discretionary {\unhbox \voidb@x \hbox {\relax \fontsize  {7}{8}\selectfont  $\leftarrow \joinrel  \rhook $}}{}{}Utils\discretionary {\unhbox \voidb@x \hbox {\relax \fontsize  {7}{8}\selectfont  $\leftarrow \joinrel  \rhook $}}{}{}Count\discretionary {\unhbox \voidb@x \hbox {\relax \fontsize  {7}{8}\selectfont  $\leftarrow \joinrel  \rhook $}}{}{}Edges}{45}{subsubsection.6.19.2.2}}
\newlabel{group__misc__tools_gad9ad5fa3dfd4dbebd3acc668c66b4ee5}{{6.19.2.2}{45}{tigl\+Utils\+Count\+Edges\relax }{subsubsection.6.19.2.2}{}}
\gdef \PWST@xxiii{1}
\gdef \PWST@xxiv{1}
\gdef \PWST@xxv{1}
\@writefile{toc}{\contentsline {subsubsection}{\numberline {6.19.2.3}tigl\discretionary {\unhbox \voidb@x \hbox {\relax \fontsize  {7}{8}\selectfont  $\leftarrow \joinrel  \rhook $}}{}{}Utils\discretionary {\unhbox \voidb@x \hbox {\relax \fontsize  {7}{8}\selectfont  $\leftarrow \joinrel  \rhook $}}{}{}Count\discretionary {\unhbox \voidb@x \hbox {\relax \fontsize  {7}{8}\selectfont  $\leftarrow \joinrel  \rhook $}}{}{}Edges}{46}{subsubsection.6.19.2.3}}
\newlabel{group__misc__tools_ga9cfa46787ac0a4b0d0240463748b537e}{{6.19.2.3}{46}{tigl\+Utils\+Count\+Edges\relax }{subsubsection.6.19.2.3}{}}
\@writefile{toc}{\contentsline {subsubsection}{\numberline {6.19.2.4}tigl\discretionary {\unhbox \voidb@x \hbox {\relax \fontsize  {7}{8}\selectfont  $\leftarrow \joinrel  \rhook $}}{}{}Utils\discretionary {\unhbox \voidb@x \hbox {\relax \fontsize  {7}{8}\selectfont  $\leftarrow \joinrel  \rhook $}}{}{}Count\discretionary {\unhbox \voidb@x \hbox {\relax \fontsize  {7}{8}\selectfont  $\leftarrow \joinrel  \rhook $}}{}{}Edges}{46}{subsubsection.6.19.2.4}}
\newlabel{group__misc__tools_ga141c5392ab4103862d53e61f2b65c466}{{6.19.2.4}{46}{tigl\+Utils\+Count\+Edges\relax }{subsubsection.6.19.2.4}{}}
\@writefile{toc}{\contentsline {subsubsection}{\numberline {6.19.2.5}tigl\discretionary {\unhbox \voidb@x \hbox {\relax \fontsize  {7}{8}\selectfont  $\leftarrow \joinrel  \rhook $}}{}{}Utils\discretionary {\unhbox \voidb@x \hbox {\relax \fontsize  {7}{8}\selectfont  $\leftarrow \joinrel  \rhook $}}{}{}Gen\discretionary {\unhbox \voidb@x \hbox {\relax \fontsize  {7}{8}\selectfont  $\leftarrow \joinrel  \rhook $}}{}{}Urandom}{46}{subsubsection.6.19.2.5}}
\newlabel{group__misc__tools_gabc4f73f9c569080abea99832e65f2248}{{6.19.2.5}{46}{tigl\+Utils\+Gen\+Urandom\relax }{subsubsection.6.19.2.5}{}}
\gdef \PWST@xxvi{2}
\@writefile{toc}{\contentsline {subsubsection}{\numberline {6.19.2.6}tigl\discretionary {\unhbox \voidb@x \hbox {\relax \fontsize  {7}{8}\selectfont  $\leftarrow \joinrel  \rhook $}}{}{}Utils\discretionary {\unhbox \voidb@x \hbox {\relax \fontsize  {7}{8}\selectfont  $\leftarrow \joinrel  \rhook $}}{}{}Register\discretionary {\unhbox \voidb@x \hbox {\relax \fontsize  {7}{8}\selectfont  $\leftarrow \joinrel  \rhook $}}{}{}Time}{47}{subsubsection.6.19.2.6}}
\newlabel{group__misc__tools_ga0ba8419685cb5738bbe07568e82eec4e}{{6.19.2.6}{47}{tigl\+Utils\+Register\+Time\relax }{subsubsection.6.19.2.6}{}}
\@setckpt{group__misc__tools}{
\setcounter{page}{48}
\setcounter{equation}{0}
\setcounter{enumi}{5}
\setcounter{enumii}{0}
\setcounter{enumiii}{0}
\setcounter{enumiv}{0}
\setcounter{footnote}{0}
\setcounter{mpfootnote}{0}
\setcounter{part}{0}
\setcounter{chapter}{6}
\setcounter{section}{19}
\setcounter{subsection}{2}
\setcounter{subsubsection}{6}
\setcounter{paragraph}{0}
\setcounter{subparagraph}{0}
\setcounter{figure}{0}
\setcounter{table}{0}
\setcounter{float@type}{4}
\setcounter{PWSTtable}{26}
\setcounter{NAT@ctr}{0}
\setcounter{lofdepth}{1}
\setcounter{lotdepth}{1}
\setcounter{Item}{47}
\setcounter{Hfootnote}{0}
\setcounter{section@level}{3}
}
