\relax 
\gdef \PWST@iv{1}
\@writefile{toc}{\contentsline {section}{\numberline {6.3}The Single-\/\discretionary {\unhbox \voidb@x \hbox {\relax \fontsize  {7}{8}\selectfont  $\leftarrow \joinrel  \rhook $}}{}{}Source Shortest Path (S\discretionary {\unhbox \voidb@x \hbox {\relax \fontsize  {7}{8}\selectfont  $\leftarrow \joinrel  \rhook $}}{}{}S\discretionary {\unhbox \voidb@x \hbox {\relax \fontsize  {7}{8}\selectfont  $\leftarrow \joinrel  \rhook $}}{}{}S\discretionary {\unhbox \voidb@x \hbox {\relax \fontsize  {7}{8}\selectfont  $\leftarrow \joinrel  \rhook $}}{}{}P) Algorithm}{23}{section.6.3}}
\newlabel{group__SSSP}{{6.3}{23}{The Single-\/\+Source Shortest Path (S\+S\+S\+P) Algorithm\relax }{section.6.3}{}}
\newlabel{group__SSSP_gaf90824509586333cf45ce757d2711ce3}{{6.3}{23}{Enumerations\relax }{section*.6}{}}
\@writefile{toc}{\contentsline {subsection}{\numberline {6.3.1}Detailed Description}{23}{subsection.6.3.1}}
\@writefile{toc}{\contentsline {subsection}{\numberline {6.3.2}Function Documentation}{23}{subsection.6.3.2}}
\@writefile{toc}{\contentsline {subsubsection}{\numberline {6.3.2.1}dijkstra}{23}{subsubsection.6.3.2.1}}
\newlabel{group__SSSP_ga1159898932867e0fe29945833a109885}{{6.3.2.1}{23}{dijkstra\relax }{subsubsection.6.3.2.1}{}}
\gdef \PWST@v{1}
\@writefile{toc}{\contentsline {subsubsection}{\numberline {6.3.2.2}main}{24}{subsubsection.6.3.2.2}}
\newlabel{group__SSSP_ga0ddf1224851353fc92bfbff6f499fa97}{{6.3.2.2}{24}{main\relax }{subsubsection.6.3.2.2}{}}
\@setckpt{group__SSSP}{
\setcounter{page}{25}
\setcounter{equation}{0}
\setcounter{enumi}{8}
\setcounter{enumii}{0}
\setcounter{enumiii}{0}
\setcounter{enumiv}{0}
\setcounter{footnote}{0}
\setcounter{mpfootnote}{0}
\setcounter{part}{0}
\setcounter{chapter}{6}
\setcounter{section}{3}
\setcounter{subsection}{2}
\setcounter{subsubsection}{2}
\setcounter{paragraph}{0}
\setcounter{subparagraph}{0}
\setcounter{figure}{0}
\setcounter{table}{0}
\setcounter{float@type}{4}
\setcounter{PWSTtable}{5}
\setcounter{NAT@ctr}{0}
\setcounter{lofdepth}{1}
\setcounter{lotdepth}{1}
\setcounter{Item}{34}
\setcounter{Hfootnote}{0}
\setcounter{section@level}{3}
}
