\relax 
\@writefile{toc}{\contentsline {section}{\numberline {6.14}Computation Engine}{40}{section.6.14}}
\newlabel{group__comp__engine}{{6.14}{40}{Computation Engine\relax }{section.6.14}{}}
\@writefile{toc}{\contentsline {subsection}{\numberline {6.14.1}Detailed Description}{40}{subsection.6.14.1}}
\@setckpt{group__comp__engine}{
\setcounter{page}{41}
\setcounter{equation}{0}
\setcounter{enumi}{5}
\setcounter{enumii}{0}
\setcounter{enumiii}{0}
\setcounter{enumiv}{0}
\setcounter{footnote}{0}
\setcounter{mpfootnote}{0}
\setcounter{part}{0}
\setcounter{chapter}{6}
\setcounter{section}{14}
\setcounter{subsection}{1}
\setcounter{subsubsection}{0}
\setcounter{paragraph}{0}
\setcounter{subparagraph}{0}
\setcounter{figure}{0}
\setcounter{table}{0}
\setcounter{float@type}{4}
\setcounter{PWSTtable}{22}
\setcounter{NAT@ctr}{0}
\setcounter{lofdepth}{1}
\setcounter{lotdepth}{1}
\setcounter{Item}{47}
\setcounter{Hfootnote}{0}
\setcounter{section@level}{2}
}
