\relax 
\providecommand\hyper@newdestlabel[2]{}
\@writefile{toc}{\contentsline {section}{\numberline {5.14}benchmark\discretionary {-}{}{}C\discretionary {-}{}{}N\discretionary {-}{}{}N}{106}{section.5.14}}
\newlabel{group__benchmarkCNN}{{5.14}{106}{benchmark\-C\-N\-N}{section.5.14}{}}
\@writefile{toc}{\contentsline {subsection}{\numberline {5.14.1}Detailed Description}{106}{subsection.5.14.1}}
\@setckpt{group__benchmarkCNN}{
\setcounter{page}{107}
\setcounter{equation}{0}
\setcounter{enumi}{0}
\setcounter{enumii}{0}
\setcounter{enumiii}{0}
\setcounter{enumiv}{0}
\setcounter{footnote}{0}
\setcounter{mpfootnote}{0}
\setcounter{part}{0}
\setcounter{chapter}{5}
\setcounter{section}{14}
\setcounter{subsection}{1}
\setcounter{subsubsection}{0}
\setcounter{paragraph}{0}
\setcounter{subparagraph}{0}
\setcounter{figure}{0}
\setcounter{table}{0}
\setcounter{float@type}{4}
\setcounter{PWSTtable}{174}
\setcounter{NAT@ctr}{0}
\setcounter{lofdepth}{1}
\setcounter{lotdepth}{1}
\setcounter{Item}{0}
\setcounter{Hfootnote}{0}
\setcounter{bookmark@seq@number}{268}
\setcounter{section@level}{2}
}
