\relax 
\providecommand\hyper@newdestlabel[2]{}
\gdef \PWST@ii{1}
\@writefile{toc}{\contentsline {section}{\numberline {5.3}app\discretionary {-}{}{}C\discretionary {-}{}{}N\discretionary {-}{}{}N\discretionary {-}{}{}Convert\discretionary {-}{}{}S\discretionary {-}{}{}B\discretionary {-}{}{}D}{27}{section.5.3}}
\newlabel{group__appCNNConvertSBD}{{5.3}{27}{app\-C\-N\-N\-Convert\-S\-B\-D}{section.5.3}{}}
\@writefile{toc}{\contentsline {subsection}{\numberline {5.3.1}Detailed Description}{27}{subsection.5.3.1}}
\@writefile{toc}{\contentsline {subsection}{\numberline {5.3.2}Function Documentation}{27}{subsection.5.3.2}}
\@writefile{toc}{\contentsline {subsubsection}{\numberline {5.3.2.1}app\discretionary {-}{}{}C\discretionary {-}{}{}N\discretionary {-}{}{}N\discretionary {-}{}{}Convert\discretionary {-}{}{}S\discretionary {-}{}{}B\discretionary {-}{}{}D\discretionary {-}{}{}Shuffle}{27}{subsubsection.5.3.2.1}}
\newlabel{group__appCNNConvertSBD_ga226073dad2d094fb581f703f1ac8b0bf}{{5.3.2.1}{27}{app\-C\-N\-N\-Convert\-S\-B\-D\-Shuffle}{subsubsection.5.3.2.1}{}}
\@writefile{toc}{\contentsline {subsubsection}{\numberline {5.3.2.2}main}{27}{subsubsection.5.3.2.2}}
\newlabel{group__appCNNConvertSBD_ga0ddf1224851353fc92bfbff6f499fa97}{{5.3.2.2}{27}{main}{subsubsection.5.3.2.2}{}}
\@setckpt{group__appCNNConvertSBD}{
\setcounter{page}{28}
\setcounter{equation}{0}
\setcounter{enumi}{0}
\setcounter{enumii}{0}
\setcounter{enumiii}{0}
\setcounter{enumiv}{0}
\setcounter{footnote}{0}
\setcounter{mpfootnote}{0}
\setcounter{part}{0}
\setcounter{chapter}{5}
\setcounter{section}{3}
\setcounter{subsection}{2}
\setcounter{subsubsection}{2}
\setcounter{paragraph}{0}
\setcounter{subparagraph}{0}
\setcounter{figure}{0}
\setcounter{table}{0}
\setcounter{float@type}{4}
\setcounter{PWSTtable}{2}
\setcounter{NAT@ctr}{0}
\setcounter{lofdepth}{1}
\setcounter{lotdepth}{1}
\setcounter{Item}{0}
\setcounter{Hfootnote}{0}
\setcounter{bookmark@seq@number}{45}
\setcounter{section@level}{3}
}
