\relax 
\providecommand\hyper@newdestlabel[2]{}
\@writefile{toc}{\contentsline {section}{\numberline {5.10}test\discretionary {-}{}{}Util}{102}{section.5.10}}
\newlabel{group__testUtil}{{5.10}{102}{test\-Util}{section.5.10}{}}
\@writefile{toc}{\contentsline {subsection}{\numberline {5.10.1}Detailed Description}{102}{subsection.5.10.1}}
\@writefile{toc}{\contentsline {subsection}{\numberline {5.10.2}Function Documentation}{102}{subsection.5.10.2}}
\@writefile{toc}{\contentsline {subsubsection}{\numberline {5.10.2.1}test\discretionary {-}{}{}Util\discretionary {-}{}{}B\discretionary {-}{}{}L\discretionary {-}{}{}A\discretionary {-}{}{}S}{102}{subsubsection.5.10.2.1}}
\newlabel{group__testUtil_ga3f5b39bac5684da3fb5bcc7d805926c0}{{5.10.2.1}{102}{test\-Util\-B\-L\-A\-S}{subsubsection.5.10.2.1}{}}
\@writefile{toc}{\contentsline {subsubsection}{\numberline {5.10.2.2}test\discretionary {-}{}{}Util\discretionary {-}{}{}Conv2}{102}{subsubsection.5.10.2.2}}
\newlabel{group__testUtil_ga26317133874a9e0ac21e66469dbecc03}{{5.10.2.2}{102}{test\-Util\-Conv2}{subsubsection.5.10.2.2}{}}
\@writefile{toc}{\contentsline {subsubsection}{\numberline {5.10.2.3}test\discretionary {-}{}{}Util\discretionary {-}{}{}Sort}{102}{subsubsection.5.10.2.3}}
\newlabel{group__testUtil_gab987fd94d97c6fbd4d93d912f82dd00c}{{5.10.2.3}{102}{test\-Util\-Sort}{subsubsection.5.10.2.3}{}}
\@setckpt{group__testUtil}{
\setcounter{page}{103}
\setcounter{equation}{0}
\setcounter{enumi}{0}
\setcounter{enumii}{0}
\setcounter{enumiii}{0}
\setcounter{enumiv}{0}
\setcounter{footnote}{0}
\setcounter{mpfootnote}{0}
\setcounter{part}{0}
\setcounter{chapter}{5}
\setcounter{section}{10}
\setcounter{subsection}{2}
\setcounter{subsubsection}{3}
\setcounter{paragraph}{0}
\setcounter{subparagraph}{0}
\setcounter{figure}{0}
\setcounter{table}{0}
\setcounter{float@type}{4}
\setcounter{PWSTtable}{174}
\setcounter{NAT@ctr}{0}
\setcounter{lofdepth}{1}
\setcounter{lotdepth}{1}
\setcounter{Item}{0}
\setcounter{Hfootnote}{0}
\setcounter{bookmark@seq@number}{260}
\setcounter{section@level}{3}
}
