\relax 
\providecommand\hyper@newdestlabel[2]{}
\@writefile{toc}{\contentsline {section}{\numberline {5.6}benchmark\discretionary {-}{}{}C\discretionary {-}{}{}N\discretionary {-}{}{}N\discretionary {-}{}{}Class}{40}{section.5.6}}
\newlabel{group__benchmarkCNNClass}{{5.6}{40}{benchmark\-C\-N\-N\-Class}{section.5.6}{}}
\newlabel{group__benchmarkCNNClass_ga9417402a234aae9eb184bda7d9c293a7}{{5.6}{40}{Functions}{section*.8}{}}
\newlabel{group__benchmarkCNNClass_ga83c37557afa0f2361fd24c3f4f01603c}{{5.6}{40}{Functions}{section*.8}{}}
\@writefile{toc}{\contentsline {subsection}{\numberline {5.6.1}Detailed Description}{40}{subsection.5.6.1}}
\@setckpt{group__benchmarkCNNClass}{
\setcounter{page}{41}
\setcounter{equation}{0}
\setcounter{enumi}{0}
\setcounter{enumii}{0}
\setcounter{enumiii}{0}
\setcounter{enumiv}{0}
\setcounter{footnote}{0}
\setcounter{mpfootnote}{0}
\setcounter{part}{0}
\setcounter{chapter}{5}
\setcounter{section}{6}
\setcounter{subsection}{1}
\setcounter{subsubsection}{0}
\setcounter{paragraph}{0}
\setcounter{subparagraph}{0}
\setcounter{figure}{0}
\setcounter{table}{0}
\setcounter{float@type}{4}
\setcounter{PWSTtable}{28}
\setcounter{NAT@ctr}{0}
\setcounter{lofdepth}{1}
\setcounter{lotdepth}{1}
\setcounter{Item}{0}
\setcounter{Hfootnote}{0}
\setcounter{bookmark@seq@number}{80}
\setcounter{section@level}{2}
}
