\relax 
\providecommand\hyper@newdestlabel[2]{}
\@writefile{toc}{\contentsline {section}{\numberline {5.9}test\discretionary {-}{}{}C\discretionary {-}{}{}N\discretionary {-}{}{}N}{100}{section.5.9}}
\newlabel{group__testCNN}{{5.9}{100}{test\-C\-N\-N}{section.5.9}{}}
\@writefile{toc}{\contentsline {subsection}{\numberline {5.9.1}Detailed Description}{100}{subsection.5.9.1}}
\@writefile{toc}{\contentsline {subsection}{\numberline {5.9.2}Function Documentation}{100}{subsection.5.9.2}}
\@writefile{toc}{\contentsline {subsubsection}{\numberline {5.9.2.1}test\discretionary {-}{}{}C\discretionary {-}{}{}N\discretionary {-}{}{}N\discretionary {-}{}{}Simple\discretionary {-}{}{}Clone}{100}{subsubsection.5.9.2.1}}
\newlabel{group__testCNN_gace350f99cda0e82ff6908b8600acc0fa}{{5.9.2.1}{100}{test\-C\-N\-N\-Simple\-Clone}{subsubsection.5.9.2.1}{}}
\@writefile{toc}{\contentsline {subsubsection}{\numberline {5.9.2.2}test\discretionary {-}{}{}C\discretionary {-}{}{}N\discretionary {-}{}{}N\discretionary {-}{}{}Simple\discretionary {-}{}{}I\discretionary {-}{}{}O}{100}{subsubsection.5.9.2.2}}
\newlabel{group__testCNN_ga5ba87fc818c8afc070449d2b4ee198d1}{{5.9.2.2}{100}{test\-C\-N\-N\-Simple\-I\-O}{subsubsection.5.9.2.2}{}}
\@writefile{toc}{\contentsline {subsubsection}{\numberline {5.9.2.3}test\discretionary {-}{}{}C\discretionary {-}{}{}N\discretionary {-}{}{}N\discretionary {-}{}{}Simple\discretionary {-}{}{}Profile}{100}{subsubsection.5.9.2.3}}
\newlabel{group__testCNN_ga4c60d6732efd76f480c1e8299d4e0423}{{5.9.2.3}{100}{test\-C\-N\-N\-Simple\-Profile}{subsubsection.5.9.2.3}{}}
\@writefile{toc}{\contentsline {subsubsection}{\numberline {5.9.2.4}test\discretionary {-}{}{}C\discretionary {-}{}{}N\discretionary {-}{}{}N\discretionary {-}{}{}Simple\discretionary {-}{}{}Resize}{101}{subsubsection.5.9.2.4}}
\newlabel{group__testCNN_ga9331ace836a032e6f7d86bc27e3a3502}{{5.9.2.4}{101}{test\-C\-N\-N\-Simple\-Resize}{subsubsection.5.9.2.4}{}}
\@writefile{toc}{\contentsline {subsubsection}{\numberline {5.9.2.5}test\discretionary {-}{}{}C\discretionary {-}{}{}N\discretionary {-}{}{}N\discretionary {-}{}{}Simple\discretionary {-}{}{}Share}{101}{subsubsection.5.9.2.5}}
\newlabel{group__testCNN_ga2f4633efc3d5831da4bf841833e665f7}{{5.9.2.5}{101}{test\-C\-N\-N\-Simple\-Share}{subsubsection.5.9.2.5}{}}
\@writefile{toc}{\contentsline {subsubsection}{\numberline {5.9.2.6}test\discretionary {-}{}{}C\discretionary {-}{}{}N\discretionary {-}{}{}N\discretionary {-}{}{}Simple\discretionary {-}{}{}Training}{101}{subsubsection.5.9.2.6}}
\newlabel{group__testCNN_gaae822c926bf3623fccbb8196504df2a1}{{5.9.2.6}{101}{test\-C\-N\-N\-Simple\-Training}{subsubsection.5.9.2.6}{}}
\@setckpt{group__testCNN}{
\setcounter{page}{102}
\setcounter{equation}{0}
\setcounter{enumi}{0}
\setcounter{enumii}{0}
\setcounter{enumiii}{0}
\setcounter{enumiv}{0}
\setcounter{footnote}{0}
\setcounter{mpfootnote}{0}
\setcounter{part}{0}
\setcounter{chapter}{5}
\setcounter{section}{9}
\setcounter{subsection}{2}
\setcounter{subsubsection}{6}
\setcounter{paragraph}{0}
\setcounter{subparagraph}{0}
\setcounter{figure}{0}
\setcounter{table}{0}
\setcounter{float@type}{4}
\setcounter{PWSTtable}{174}
\setcounter{NAT@ctr}{0}
\setcounter{lofdepth}{1}
\setcounter{lotdepth}{1}
\setcounter{Item}{0}
\setcounter{Hfootnote}{0}
\setcounter{bookmark@seq@number}{254}
\setcounter{section@level}{3}
}
